{"text_format":"1","workbook":"xlsx","n_sheets":14,"sheets":["Informacija","version","duomenys","formules","Indifference","iliustracijos","matrix","1","2","3","4","strings","5","6"],"not_rendered":{"charts":1,"images":79,"macros":1,"external_links":0,"defined_names":66,"comments":2,"pivot_tables":0},"unopened":[],"bounds":{"document_bytes":16777216,"sheet_cells":100000,"rows_first":2000,"rows_last":500,"rows_between":2000,"halvings":0,"cell_chars":16384,"cell_head_chars":4096},"cells_cut":0,"cells_raw":0,"read":"whole","date_system":"1900"}

{"sheet":"Informacija","index":0,"n_rows":42,"n_cols":7,"rows_kept":42,"cut":false,"hidden":false,"merged":[[18,3,19,3],[23,3,24,3],[6,6,7,7],[2,3,3,3],[4,3,5,3],[7,3,8,3],[10,3,11,3],[13,3,14,3]]}
[]
[]
[null,null,5,"Laukelis pagal pasirinktą formulę nenaudojamas skaičiavimams net jeigu ir užpildytas"]
[]
[null,null,null,"Laukelis pagal pasirinktą formulę naudojamas skaičiavimams, bet neužpildytas"]
[]
[null,null,null,null,null,null,"Šiuose langeliuose galima pasirinkti formulę"]
[null,null,null,"Laukelis pagal pasirinktą formulę naudojamas skaičiavimams, užpildytas"]
[]
[]
[null,null,89.5,"Laimėjusio pasiūlymo balas. Atkreiptinas dėmesys, kad kai kuriose formulėse tai bus ne didžiausias, o mažiausias skaičius"]
[]
[]
[null,null,30,"Kokybinio parametro nurodyta balų vertė viršija maksimalią galimą reikšmę (formulėse, naudojančiose svorius – to kriterijaus svorį). "]
[]
[]
[]
[]
[null,null,null,"Raudonas langelio kampas reiškia, kad privedus pelės žymeklį bus rodoma papildoma informacija"]
[]
[]
[null,null,15,"Tarpiniai skaičiavimai, tarpiniai balai. Nepildomas laukelis. "]
[]
[null,null,null,"Nepasirinkta kokybės kriterijaus vertinimo tvarka, nors yra užpildytas langelis šio laukelio kairėje"]
[]
[]
[null,"Dėmesio! Norint naudotis visomis skaičiuoklės funkcijomis, būtina patvirtinti „excel“ programos rodomus įspėjimus."]
[]
[]
[]
[]
[]
[]
[]
[]
[]
[]
[]
[]
[]
[]
[null,"Jeigu matote žemiau pavaizduotą pranešimą, reiškia įjungę skaičiuoklę nespustelėjote aukščiau parodytų mygtukų. Atidarykite skaičiuoklę pakartotinai."]

{"sheet":"version","index":1,"n_rows":2,"n_cols":1,"rows_kept":2,"cut":false,"hidden":true,"merged":[]}
["Column1"]
["Versija 1.00, 2021-02-19"]

{"sheet":"duomenys","index":2,"n_rows":43,"n_cols":17,"rows_kept":43,"cut":false,"hidden":false,"merged":[[48,20,48,28],[1,8,3,8],[1,13,3,13],[1,11,3,11],[1,12,3,12],[1,10,3,10],[1,9,3,9],[11,15,12,15],[36,3,36,14],[1,7,3,7],[1,6,3,6],[1,5,3,5],[37,5,37,14],[42,3,42,4],[41,3,41,4],[40,3,40,4],[11,0,12,0],[11,2,12,2],[1,4,3,4],[1,3,3,3],[25,2,26,2],[15,2,16,2],[17,2,18,2],[19,2,20,2],[23,2,24,2],[21,0,22,0],[23,1,24,1],[23,0,24,0],[25,1,26,1],[25,0,26,0],[21,2,22,2],[21,1,22,1],[11,1,12,1],[34,3,34,4],[27,2,28,2],[29,2,30,2],[27,1,28,1],[23,4,24,4],[23,3,24,3],[21,3,22,3],[17,3,18,3],[17,4,18,4],[19,3,20,3],[19,4,20,4],[21,4,22,4],[11,3,12,3],[11,4,12,4],[13,4,14,4],[13,0,14,0],[13,1,14,1],[31,1,31,2],[32,1,32,2],[15,1,16,1],[17,1,18,1],[17,0,18,0],[19,1,20,1],[19,0,20,0],[27,0,28,0],[29,1,30,1],[29,0,30,0],[13,2,14,2],[15,0,16,0],[31,0,33,0],[33,1,33,2],[13,3,14,3],[15,4,16,4],[15,3,16,3],[39,3,39,4],[25,4,26,4],[31,3,31,4],[32,3,32,4],[33,3,33,4],[38,3,38,4],[37,3,37,4],[25,3,26,3],[27,3,28,3],[27,4,28,4],[29,3,30,3],[29,4,30,4]]}
[]
[{"$f":"CONCATENATE(\"Kaina: \",WP,\" Kokybė: \",100-WP)","v":"Kaina: 65 Kokybė: 35"},{"$f":"IF(VLOOKUP($C$11,formules!$A$2:$AE81,31,FALSE)=1,\"Formulei būtina nurodyti maksimalią kainą\",\"\")","v":"Formulei būtina nurodyti maksimalią kainą"}]
[null,{"$f":"IF(VLOOKUP($C$11,formules!$A$2:$AE81,30,FALSE)=1,\"Laimi mažiausiai balų surinkęs pasiūlymas\",\"\")","v":""},null,null,null,null,null,null,null,null,null,null,null,null,null,"peržiūrėti negometrix"]
[null,null,null,null,null,null,null,null,null,null,null,null,null,null,null,"chen klaida, gal antroje dalyje aukštyn kojom."]
[null,null,null,null,null,null,"2011 m.",null,{"$f":"VLOOKUP($C$11,formules!$A$2:$AE79,24,FALSE)","v":"N/A"},{"$f":"VLOOKUP($C$11,formules!$A$2:$AE79,25,FALSE)","v":"N/A"},{"$f":"VLOOKUP($C$11,formules!$A$2:$AE79,26,FALSE)","v":"N/A"},{"$f":"VLOOKUP($C$11,formules!$A$2:$AE79,27,FALSE)","v":0},{"$f":"VLOOKUP($C$11,formules!$A$2:$AE79,28,FALSE)","v":0},{"$f":"VLOOKUP($C$11,formules!$A$2:$AE79,29,FALSE)","v":"N/A"}]
[null,null,null,null,null,null,"2017 m.",null,null,null,null,{"$f":"VLOOKUP($C$11,formules!$A$2:$AN79,39,FALSE)","v":0},{"$f":"VLOOKUP($C$11,formules!$A$2:$AN79,40,FALSE)","v":0}]
[null,null,null,null,null,{"$f":"VLOOKUP($C$11,formules!$A$2:$AE81,21,FALSE)","v":2},{"$f":"VLOOKUP($C$11,formules!$A$2:$AE81,22,FALSE)","v":2},{"$f":"VLOOKUP($C$11,formules!$A$2:$AE81,23,FALSE)","v":1}]
[]
[]
[{"$f":"IF(formules!$A$72=\"ne\",\"Maks. balų\",\"Svoris\")","v":"Svoris"},"Kriterijus","Formulė","Min","Max","Tiekėjas 1","Tiekėjas 2","Tiekėjas 3","Tiekėjas 4","Tiekėjas 5","Tiekėjas 6","Tiekėjas 7","Tiekėjas 8","Tiekėjas 9","Tiekėjas 10"]
[65,"Kaina","1.2. Telgen  (Absoliutinė)",0,200860]
[35,"Nefunkcinių ir funkcinių reikalavimų įgyvendinimas","Tiesioginis balų suteikimas",null,null,null,null,null,null,null,null,null,null,null,null,null,{"$f":"IFERROR(VLOOKUP(C12,formules!$A$52:$C$55,3,FALSE),0)","v":4}]
[null,null,null,null,null,{"$f":"IF(AND($A12<>\"\",$C12<>\"\"),INDIRECT(VLOOKUP($C12,formules!$A$49:$C$59,3,FALSE)&\"!\"&matrix!A1),\"\")","v":""},{"$f":"IF(AND($A12<>\"\",$C12<>\"\"),INDIRECT(VLOOKUP($C12,formules!$A$49:$C$59,3,FALSE)&\"!\"&matrix!B1),\"\")","v":""},{"$f":"IF(AND($A12<>\"\",$C12<>\"\"),INDIRECT(VLOOKUP($C12,formules!$A$49:$C$59,3,FALSE)&\"!\"&matrix!C1),\"\")","v":""},{"$f":"IF(AND($A12<>\"\",$C12<>\"\"),INDIRECT(VLOOKUP($C12,formules!$A$49:$C$59,3,FALSE)&\"!\"&matrix!D1),\"\")","v":""},{"$f":"IF(AND($A12<>\"\",$C12<>\"\"),INDIRECT(VLOOKUP($C12,formules!$A$49:$C$59,3,FALSE)&\"!\"&matrix!E1),\"\")","v":""},{"$f":"IF(AND($A12<>\"\",$C12<>\"\"),INDIRECT(VLOOKUP($C12,formules!$A$49:$C$59,3,FALSE)&\"!\"&matrix!F1),\"\")","v":""},{"$f":"IF(AND($A12<>\"\",$C12<>\"\"),INDIRECT(VLOOKUP($C12,formules!$A$49:$C$59,3,FALSE)&\"!\"&matrix!G1),\"\")","v":""},{"$f":"IF(AND($A12<>\"\",$C12<>\"\"),INDIRECT(VLOOKUP($C12,formules!$A$49:$C$59,3,FALSE)&\"!\"&matrix!H1),\"\")","v":""},{"$f":"IF(AND($A12<>\"\",$C12<>\"\"),INDIRECT(VLOOKUP($C12,formules!$A$49:$C$59,3,FALSE)&\"!\"&matrix!I1),\"\")","v":""},{"$f":"IF(AND($A12<>\"\",$C12<>\"\"),INDIRECT(VLOOKUP($C12,formules!$A$49:$C$59,3,FALSE)&\"!\"&matrix!J1),\"\")","v":""}]
[null,null,null,null,null,null,null,null,null,null,null,null,null,null,null,null,{"$f":"IFERROR(VLOOKUP(C14,formules!$A$52:$C$55,3,FALSE),0)","v":0}]
[null,null,null,null,null,{"$f":"IF(AND($A14<>\"\",$C14<>\"\"),INDIRECT(VLOOKUP($C14,formules!$A$49:$C$59,3,FALSE)&\"!\"&matrix!A2),\"\")","v":""},{"$f":"IF(AND($A14<>\"\",$C14<>\"\"),INDIRECT(VLOOKUP($C14,formules!$A$49:$C$59,3,FALSE)&\"!\"&matrix!B2),\"\")","v":""},{"$f":"IF(AND($A14<>\"\",$C14<>\"\"),INDIRECT(VLOOKUP($C14,formules!$A$49:$C$59,3,FALSE)&\"!\"&matrix!C2),\"\")","v":""},{"$f":"IF(AND($A14<>\"\",$C14<>\"\"),INDIRECT(VLOOKUP($C14,formules!$A$49:$C$59,3,FALSE)&\"!\"&matrix!D2),\"\")","v":""},{"$f":"IF(AND($A14<>\"\",$C14<>\"\"),INDIRECT(VLOOKUP($C14,formules!$A$49:$C$59,3,FALSE)&\"!\"&matrix!E2),\"\")","v":""},{"$f":"IF(AND($A14<>\"\",$C14<>\"\"),INDIRECT(VLOOKUP($C14,formules!$A$49:$C$59,3,FALSE)&\"!\"&matrix!F2),\"\")","v":""},{"$f":"IF(AND($A14<>\"\",$C14<>\"\"),INDIRECT(VLOOKUP($C14,formules!$A$49:$C$59,3,FALSE)&\"!\"&matrix!G2),\"\")","v":""},{"$f":"IF(AND($A14<>\"\",$C14<>\"\"),INDIRECT(VLOOKUP($C14,formules!$A$49:$C$59,3,FALSE)&\"!\"&matrix!H2),\"\")","v":""},{"$f":"IF(AND($A14<>\"\",$C14<>\"\"),INDIRECT(VLOOKUP($C14,formules!$A$49:$C$59,3,FALSE)&\"!\"&matrix!I2),\"\")","v":""},{"$f":"IF(AND($A14<>\"\",$C14<>\"\"),INDIRECT(VLOOKUP($C14,formules!$A$49:$C$59,3,FALSE)&\"!\"&matrix!J2),\"\")","v":""}]
[null,null,null,null,null,null,null,null,null,null,null,null,null,null,null,null,{"$f":"IFERROR(VLOOKUP(C16,formules!$A$52:$C$55,3,FALSE),0)","v":0}]
[null,null,null,null,null,{"$f":"IF(AND($A16<>\"\",$C16<>\"\"),INDIRECT(VLOOKUP($C16,formules!$A$49:$C$59,3,FALSE)&\"!\"&matrix!A3),\"\")","v":""},{"$f":"IF(AND($A16<>\"\",$C16<>\"\"),INDIRECT(VLOOKUP($C16,formules!$A$49:$C$59,3,FALSE)&\"!\"&matrix!B3),\"\")","v":""},{"$f":"IF(AND($A16<>\"\",$C16<>\"\"),INDIRECT(VLOOKUP($C16,formules!$A$49:$C$59,3,FALSE)&\"!\"&matrix!C3),\"\")","v":""},{"$f":"IF(AND($A16<>\"\",$C16<>\"\"),INDIRECT(VLOOKUP($C16,formules!$A$49:$C$59,3,FALSE)&\"!\"&matrix!D3),\"\")","v":""},{"$f":"IF(AND($A16<>\"\",$C16<>\"\"),INDIRECT(VLOOKUP($C16,formules!$A$49:$C$59,3,FALSE)&\"!\"&matrix!E3),\"\")","v":""},{"$f":"IF(AND($A16<>\"\",$C16<>\"\"),INDIRECT(VLOOKUP($C16,formules!$A$49:$C$59,3,FALSE)&\"!\"&matrix!F3),\"\")","v":""},{"$f":"IF(AND($A16<>\"\",$C16<>\"\"),INDIRECT(VLOOKUP($C16,formules!$A$49:$C$59,3,FALSE)&\"!\"&matrix!G3),\"\")","v":""},{"$f":"IF(AND($A16<>\"\",$C16<>\"\"),INDIRECT(VLOOKUP($C16,formules!$A$49:$C$59,3,FALSE)&\"!\"&matrix!H3),\"\")","v":""},{"$f":"IF(AND($A16<>\"\",$C16<>\"\"),INDIRECT(VLOOKUP($C16,formules!$A$49:$C$59,3,FALSE)&\"!\"&matrix!I3),\"\")","v":""},{"$f":"IF(AND($A16<>\"\",$C16<>\"\"),INDIRECT(VLOOKUP($C16,formules!$A$49:$C$59,3,FALSE)&\"!\"&matrix!J3),\"\")","v":""}]
[null,null,null,null,null,null,null,null,null,null,null,null,null,null,null,null,{"$f":"IFERROR(VLOOKUP(C18,formules!$A$52:$C$55,3,FALSE),0)","v":0}]
[null,null,null,null,null,{"$f":"IF(AND($A18<>\"\",$C18<>\"\"),INDIRECT(VLOOKUP($C18,formules!$A$49:$C$59,3,FALSE)&\"!\"&matrix!A4),\"\")","v":""},{"$f":"IF(AND($A18<>\"\",$C18<>\"\"),INDIRECT(VLOOKUP($C18,formules!$A$49:$C$59,3,FALSE)&\"!\"&matrix!B4),\"\")","v":""},{"$f":"IF(AND($A18<>\"\",$C18<>\"\"),INDIRECT(VLOOKUP($C18,formules!$A$49:$C$59,3,FALSE)&\"!\"&matrix!C4),\"\")","v":""},{"$f":"IF(AND($A18<>\"\",$C18<>\"\"),INDIRECT(VLOOKUP($C18,formules!$A$49:$C$59,3,FALSE)&\"!\"&matrix!D4),\"\")","v":""},{"$f":"IF(AND($A18<>\"\",$C18<>\"\"),INDIRECT(VLOOKUP($C18,formules!$A$49:$C$59,3,FALSE)&\"!\"&matrix!E4),\"\")","v":""},{"$f":"IF(AND($A18<>\"\",$C18<>\"\"),INDIRECT(VLOOKUP($C18,formules!$A$49:$C$59,3,FALSE)&\"!\"&matrix!F4),\"\")","v":""},{"$f":"IF(AND($A18<>\"\",$C18<>\"\"),INDIRECT(VLOOKUP($C18,formules!$A$49:$C$59,3,FALSE)&\"!\"&matrix!G4),\"\")","v":""},{"$f":"IF(AND($A18<>\"\",$C18<>\"\"),INDIRECT(VLOOKUP($C18,formules!$A$49:$C$59,3,FALSE)&\"!\"&matrix!H4),\"\")","v":""},{"$f":"IF(AND($A18<>\"\",$C18<>\"\"),INDIRECT(VLOOKUP($C18,formules!$A$49:$C$59,3,FALSE)&\"!\"&matrix!I4),\"\")","v":""},{"$f":"IF(AND($A18<>\"\",$C18<>\"\"),INDIRECT(VLOOKUP($C18,formules!$A$49:$C$59,3,FALSE)&\"!\"&matrix!J4),\"\")","v":""}]
[null,null,null,null,null,null,null,null,null,null,null,null,null,null,null,null,{"$f":"IFERROR(VLOOKUP(C20,formules!$A$52:$C$55,3,FALSE),0)","v":0}]
[null,null,null,null,null,{"$f":"IF(AND($A20<>\"\",$C20<>\"\"),INDIRECT(VLOOKUP($C20,formules!$A$49:$C$59,3,FALSE)&\"!\"&matrix!A5),\"\")","v":""},{"$f":"IF(AND($A20<>\"\",$C20<>\"\"),INDIRECT(VLOOKUP($C20,formules!$A$49:$C$59,3,FALSE)&\"!\"&matrix!B5),\"\")","v":""},{"$f":"IF(AND($A20<>\"\",$C20<>\"\"),INDIRECT(VLOOKUP($C20,formules!$A$49:$C$59,3,FALSE)&\"!\"&matrix!C5),\"\")","v":""},{"$f":"IF(AND($A20<>\"\",$C20<>\"\"),INDIRECT(VLOOKUP($C20,formules!$A$49:$C$59,3,FALSE)&\"!\"&matrix!D5),\"\")","v":""},{"$f":"IF(AND($A20<>\"\",$C20<>\"\"),INDIRECT(VLOOKUP($C20,formules!$A$49:$C$59,3,FALSE)&\"!\"&matrix!E5),\"\")","v":""},{"$f":"IF(AND($A20<>\"\",$C20<>\"\"),INDIRECT(VLOOKUP($C20,formules!$A$49:$C$59,3,FALSE)&\"!\"&matrix!F5),\"\")","v":""},{"$f":"IF(AND($A20<>\"\",$C20<>\"\"),INDIRECT(VLOOKUP($C20,formules!$A$49:$C$59,3,FALSE)&\"!\"&matrix!G5),\"\")","v":""},{"$f":"IF(AND($A20<>\"\",$C20<>\"\"),INDIRECT(VLOOKUP($C20,formules!$A$49:$C$59,3,FALSE)&\"!\"&matrix!H5),\"\")","v":""},{"$f":"IF(AND($A20<>\"\",$C20<>\"\"),INDIRECT(VLOOKUP($C20,formules!$A$49:$C$59,3,FALSE)&\"!\"&matrix!I5),\"\")","v":""},{"$f":"IF(AND($A20<>\"\",$C20<>\"\"),INDIRECT(VLOOKUP($C20,formules!$A$49:$C$59,3,FALSE)&\"!\"&matrix!J5),\"\")","v":""}]
[null,null,null,null,null,null,null,null,null,null,null,null,null,null,null,null,{"$f":"IFERROR(VLOOKUP(C22,formules!$A$52:$C$55,3,FALSE),0)","v":0}]
[null,null,null,null,null,{"$f":"IF(AND($A22<>\"\",$C22<>\"\"),INDIRECT(VLOOKUP($C22,formules!$A$49:$C$59,3,FALSE)&\"!\"&matrix!A6),\"\")","v":""},{"$f":"IF(AND($A22<>\"\",$C22<>\"\"),INDIRECT(VLOOKUP($C22,formules!$A$49:$C$59,3,FALSE)&\"!\"&matrix!B6),\"\")","v":""},{"$f":"IF(AND($A22<>\"\",$C22<>\"\"),INDIRECT(VLOOKUP($C22,formules!$A$49:$C$59,3,FALSE)&\"!\"&matrix!C6),\"\")","v":""},{"$f":"IF(AND($A22<>\"\",$C22<>\"\"),INDIRECT(VLOOKUP($C22,formules!$A$49:$C$59,3,FALSE)&\"!\"&matrix!D6),\"\")","v":""},{"$f":"IF(AND($A22<>\"\",$C22<>\"\"),INDIRECT(VLOOKUP($C22,formules!$A$49:$C$59,3,FALSE)&\"!\"&matrix!E6),\"\")","v":""},{"$f":"IF(AND($A22<>\"\",$C22<>\"\"),INDIRECT(VLOOKUP($C22,formules!$A$49:$C$59,3,FALSE)&\"!\"&matrix!F6),\"\")","v":""},{"$f":"IF(AND($A22<>\"\",$C22<>\"\"),INDIRECT(VLOOKUP($C22,formules!$A$49:$C$59,3,FALSE)&\"!\"&matrix!G6),\"\")","v":""},{"$f":"IF(AND($A22<>\"\",$C22<>\"\"),INDIRECT(VLOOKUP($C22,formules!$A$49:$C$59,3,FALSE)&\"!\"&matrix!H6),\"\")","v":""},{"$f":"IF(AND($A22<>\"\",$C22<>\"\"),INDIRECT(VLOOKUP($C22,formules!$A$49:$C$59,3,FALSE)&\"!\"&matrix!I6),\"\")","v":""},{"$f":"IF(AND($A22<>\"\",$C22<>\"\"),INDIRECT(VLOOKUP($C22,formules!$A$49:$C$59,3,FALSE)&\"!\"&matrix!J6),\"\")","v":""}]
[null,null,null,null,null,null,null,null,null,null,null,null,null,null,null,null,{"$f":"IFERROR(VLOOKUP(C24,formules!$A$52:$C$55,3,FALSE),0)","v":0}]
[null,null,null,null,null,{"$f":"IF(AND($A24<>\"\",$C24<>\"\"),INDIRECT(VLOOKUP($C24,formules!$A$49:$C$59,3,FALSE)&\"!\"&matrix!A7),\"\")","v":""},{"$f":"IF(AND($A24<>\"\",$C24<>\"\"),INDIRECT(VLOOKUP($C24,formules!$A$49:$C$59,3,FALSE)&\"!\"&matrix!B7),\"\")","v":""},{"$f":"IF(AND($A24<>\"\",$C24<>\"\"),INDIRECT(VLOOKUP($C24,formules!$A$49:$C$59,3,FALSE)&\"!\"&matrix!C7),\"\")","v":""},{"$f":"IF(AND($A24<>\"\",$C24<>\"\"),INDIRECT(VLOOKUP($C24,formules!$A$49:$C$59,3,FALSE)&\"!\"&matrix!D7),\"\")","v":""},{"$f":"IF(AND($A24<>\"\",$C24<>\"\"),INDIRECT(VLOOKUP($C24,formules!$A$49:$C$59,3,FALSE)&\"!\"&matrix!E7),\"\")","v":""},{"$f":"IF(AND($A24<>\"\",$C24<>\"\"),INDIRECT(VLOOKUP($C24,formules!$A$49:$C$59,3,FALSE)&\"!\"&matrix!F7),\"\")","v":""},{"$f":"IF(AND($A24<>\"\",$C24<>\"\"),INDIRECT(VLOOKUP($C24,formules!$A$49:$C$59,3,FALSE)&\"!\"&matrix!G7),\"\")","v":""},{"$f":"IF(AND($A24<>\"\",$C24<>\"\"),INDIRECT(VLOOKUP($C24,formules!$A$49:$C$59,3,FALSE)&\"!\"&matrix!H7),\"\")","v":""},{"$f":"IF(AND($A24<>\"\",$C24<>\"\"),INDIRECT(VLOOKUP($C24,formules!$A$49:$C$59,3,FALSE)&\"!\"&matrix!I7),\"\")","v":""},{"$f":"IF(AND($A24<>\"\",$C24<>\"\"),INDIRECT(VLOOKUP($C24,formules!$A$49:$C$59,3,FALSE)&\"!\"&matrix!J7),\"\")","v":""}]
[null,null,null,null,null,null,null,null,null,null,null,null,null,null,null,null,{"$f":"IFERROR(VLOOKUP(C26,formules!$A$52:$C$55,3,FALSE),0)","v":0}]
[null,null,null,null,null,{"$f":"IF(AND($A26<>\"\",$C26<>\"\"),INDIRECT(VLOOKUP($C26,formules!$A$49:$C$59,3,FALSE)&\"!\"&matrix!A8),\"\")","v":""},{"$f":"IF(AND($A26<>\"\",$C26<>\"\"),INDIRECT(VLOOKUP($C26,formules!$A$49:$C$59,3,FALSE)&\"!\"&matrix!B8),\"\")","v":""},{"$f":"IF(AND($A26<>\"\",$C26<>\"\"),INDIRECT(VLOOKUP($C26,formules!$A$49:$C$59,3,FALSE)&\"!\"&matrix!C8),\"\")","v":""},{"$f":"IF(AND($A26<>\"\",$C26<>\"\"),INDIRECT(VLOOKUP($C26,formules!$A$49:$C$59,3,FALSE)&\"!\"&matrix!D8),\"\")","v":""},{"$f":"IF(AND($A26<>\"\",$C26<>\"\"),INDIRECT(VLOOKUP($C26,formules!$A$49:$C$59,3,FALSE)&\"!\"&matrix!E8),\"\")","v":""},{"$f":"IF(AND($A26<>\"\",$C26<>\"\"),INDIRECT(VLOOKUP($C26,formules!$A$49:$C$59,3,FALSE)&\"!\"&matrix!F8),\"\")","v":""},{"$f":"IF(AND($A26<>\"\",$C26<>\"\"),INDIRECT(VLOOKUP($C26,formules!$A$49:$C$59,3,FALSE)&\"!\"&matrix!G8),\"\")","v":""},{"$f":"IF(AND($A26<>\"\",$C26<>\"\"),INDIRECT(VLOOKUP($C26,formules!$A$49:$C$59,3,FALSE)&\"!\"&matrix!H8),\"\")","v":""},{"$f":"IF(AND($A26<>\"\",$C26<>\"\"),INDIRECT(VLOOKUP($C26,formules!$A$49:$C$59,3,FALSE)&\"!\"&matrix!I8),\"\")","v":""},{"$f":"IF(AND($A26<>\"\",$C26<>\"\"),INDIRECT(VLOOKUP($C26,formules!$A$49:$C$59,3,FALSE)&\"!\"&matrix!J8),\"\")","v":""}]
[null,null,null,null,null,null,null,null,null,null,null,null,null,null,null,null,{"$f":"IFERROR(VLOOKUP(C28,formules!$A$52:$C$55,3,FALSE),0)","v":0}]
[null,null,null,null,null,{"$f":"IF(AND($A28<>\"\",$C28<>\"\"),INDIRECT(VLOOKUP($C28,formules!$A$49:$C$59,3,FALSE)&\"!\"&matrix!A9),\"\")","v":""},{"$f":"IF(AND($A28<>\"\",$C28<>\"\"),INDIRECT(VLOOKUP($C28,formules!$A$49:$C$59,3,FALSE)&\"!\"&matrix!B9),\"\")","v":""},{"$f":"IF(AND($A28<>\"\",$C28<>\"\"),INDIRECT(VLOOKUP($C28,formules!$A$49:$C$59,3,FALSE)&\"!\"&matrix!C9),\"\")","v":""},{"$f":"IF(AND($A28<>\"\",$C28<>\"\"),INDIRECT(VLOOKUP($C28,formules!$A$49:$C$59,3,FALSE)&\"!\"&matrix!D9),\"\")","v":""},{"$f":"IF(AND($A28<>\"\",$C28<>\"\"),INDIRECT(VLOOKUP($C28,formules!$A$49:$C$59,3,FALSE)&\"!\"&matrix!E9),\"\")","v":""},{"$f":"IF(AND($A28<>\"\",$C28<>\"\"),INDIRECT(VLOOKUP($C28,formules!$A$49:$C$59,3,FALSE)&\"!\"&matrix!F9),\"\")","v":""},{"$f":"IF(AND($A28<>\"\",$C28<>\"\"),INDIRECT(VLOOKUP($C28,formules!$A$49:$C$59,3,FALSE)&\"!\"&matrix!G9),\"\")","v":""},{"$f":"IF(AND($A28<>\"\",$C28<>\"\"),INDIRECT(VLOOKUP($C28,formules!$A$49:$C$59,3,FALSE)&\"!\"&matrix!H9),\"\")","v":""},{"$f":"IF(AND($A28<>\"\",$C28<>\"\"),INDIRECT(VLOOKUP($C28,formules!$A$49:$C$59,3,FALSE)&\"!\"&matrix!I9),\"\")","v":""},{"$f":"IF(AND($A28<>\"\",$C28<>\"\"),INDIRECT(VLOOKUP($C28,formules!$A$49:$C$59,3,FALSE)&\"!\"&matrix!J9),\"\")","v":""}]
[null,null,null,null,null,null,null,null,null,null,null,null,null,null,null,null,{"$f":"IFERROR(VLOOKUP(C30,formules!$A$52:$C$55,3,FALSE),0)","v":0}]
[null,null,null,null,null,{"$f":"IF(AND($A30<>\"\",$C30<>\"\"),INDIRECT(VLOOKUP($C30,formules!$A$49:$C$59,3,FALSE)&\"!\"&matrix!A10),\"\")","v":""},{"$f":"IF(AND($A30<>\"\",$C30<>\"\"),INDIRECT(VLOOKUP($C30,formules!$A$49:$C$59,3,FALSE)&\"!\"&matrix!B10),\"\")","v":""},{"$f":"IF(AND($A30<>\"\",$C30<>\"\"),INDIRECT(VLOOKUP($C30,formules!$A$49:$C$59,3,FALSE)&\"!\"&matrix!C10),\"\")","v":""},{"$f":"IF(AND($A30<>\"\",$C30<>\"\"),INDIRECT(VLOOKUP($C30,formules!$A$49:$C$59,3,FALSE)&\"!\"&matrix!D10),\"\")","v":""},{"$f":"IF(AND($A30<>\"\",$C30<>\"\"),INDIRECT(VLOOKUP($C30,formules!$A$49:$C$59,3,FALSE)&\"!\"&matrix!E10),\"\")","v":""},{"$f":"IF(AND($A30<>\"\",$C30<>\"\"),INDIRECT(VLOOKUP($C30,formules!$A$49:$C$59,3,FALSE)&\"!\"&matrix!F10),\"\")","v":""},{"$f":"IF(AND($A30<>\"\",$C30<>\"\"),INDIRECT(VLOOKUP($C30,formules!$A$49:$C$59,3,FALSE)&\"!\"&matrix!G10),\"\")","v":""},{"$f":"IF(AND($A30<>\"\",$C30<>\"\"),INDIRECT(VLOOKUP($C30,formules!$A$49:$C$59,3,FALSE)&\"!\"&matrix!H10),\"\")","v":""},{"$f":"IF(AND($A30<>\"\",$C30<>\"\"),INDIRECT(VLOOKUP($C30,formules!$A$49:$C$59,3,FALSE)&\"!\"&matrix!I10),\"\")","v":""},{"$f":"IF(AND($A30<>\"\",$C30<>\"\"),INDIRECT(VLOOKUP($C30,formules!$A$49:$C$59,3,FALSE)&\"!\"&matrix!J10),\"\")","v":""}]
[{"$f":"SUM(A11:A31)","v":100},{"$f":"IF(VLOOKUP($C$11,formules!$A$2:$AN82,36,FALSE)<>0,VLOOKUP($C$11,formules!$A$2:$AN82,36,FALSE),\"\")","v":""},null,2]
[null,{"$f":"IF(VLOOKUP($C$11,formules!$A$2:$AN82,37,FALSE)<>0,VLOOKUP($C$11,formules!$A$2:$AN82,37,FALSE),\"\")","v":""},null,5]
[null,{"$f":"IF(VLOOKUP($C$11,formules!$A$2:$AN82,35,FALSE)<>0,\"n\",\"\")","v":""},null,1]
[null,null,null,"Iš viso balų",null,{"$f":"IF(OR(ISERROR(VLOOKUP($C$11,formules!$A$2:$N$60,formules!B64,FALSE)),F11=\"\"),\"\",VLOOKUP($C$11,formules!$A$2:$N$60,formules!B64,FALSE))","v":""},{"$f":"IF(OR(ISERROR(VLOOKUP($C$11,formules!$A$2:$N$60,formules!C64,FALSE)),G11=\"\"),\"\",VLOOKUP($C$11,formules!$A$2:$N$60,formules!C64,FALSE))","v":""},{"$f":"IF(OR(ISERROR(VLOOKUP($C$11,formules!$A$2:$N$60,formules!D64,FALSE)),H11=\"\"),\"\",VLOOKUP($C$11,formules!$A$2:$N$60,formules!D64,FALSE))","v":""},{"$f":"IF(OR(ISERROR(VLOOKUP($C$11,formules!$A$2:$N$60,formules!E64,FALSE)),I11=\"\"),\"\",VLOOKUP($C$11,formules!$A$2:$N$60,formules!E64,FALSE))","v":""},{"$f":"IF(OR(ISERROR(VLOOKUP($C$11,formules!$A$2:$N$60,formules!F64,FALSE)),J11=\"\"),\"\",VLOOKUP($C$11,formules!$A$2:$N$60,formules!F64,FALSE))","v":""},{"$f":"IF(OR(ISERROR(VLOOKUP($C$11,formules!$A$2:$N$60,formules!G64,FALSE)),K11=\"\"),\"\",VLOOKUP($C$11,formules!$A$2:$N$60,formules!G64,FALSE))","v":""},{"$f":"IF(OR(ISERROR(VLOOKUP($C$11,formules!$A$2:$N$60,formules!H64,FALSE)),L11=\"\"),\"\",VLOOKUP($C$11,formules!$A$2:$N$60,formules!H64,FALSE))","v":""},{"$f":"IF(OR(ISERROR(VLOOKUP($C$11,formules!$A$2:$N$60,formules!I64,FALSE)),M11=\"\"),\"\",VLOOKUP($C$11,formules!$A$2:$N$60,formules!I64,FALSE))","v":""},{"$f":"IF(OR(ISERROR(VLOOKUP($C$11,formules!$A$2:$N$60,formules!J64,FALSE)),N11=\"\"),\"\",VLOOKUP($C$11,formules!$A$2:$N$60,formules!J64,FALSE))","v":""},{"$f":"IF(OR(ISERROR(VLOOKUP($C$11,formules!$A$2:$O$60,formules!K64,FALSE)),O11=\"\"),\"\",VLOOKUP($C$11,formules!$A$2:$O$60,formules!K64,FALSE))","v":""}]
[null,null,null,"už kainą:",null,{"$f":"IFERROR(F35-F39,\"\")","v":""},"","","","","","","","",""]
[null,null,null,"Skaičiavimams naudota, tarpiniai skaičiavimai:"]
[null,null,null,"Bendri kintamieji:",null,{"$f":"VLOOKUP($C$11,formules!$A$2:$AP82,17,FALSE)","v":"Psetmax=200860€; Psetmin=0€; Wkokybė=35; Wkaina=65"}]
[null,null,null,{"$f":"IF(Q39=\"n\",\"Qi (balais)\",\"Wkokybė x Qi\")","v":"Wkokybė x Qi"},null,{"$f":"IF(AND(F12<>\"\",F11<>\"\"),(SUM(F13,F15,F17,F19,F21,F23,F25,F27,F29,F31)),\"\")","v":""},"","","","","","","","","",null,{"$f":"VLOOKUP($C$11,formules!$A$2:$AP82,19,FALSE)","v":0}]
[null,null,null,"Qi %",null,{"$f":"IFERROR(F39/WQ,\"\")","v":""},"","","","","","","","","","Versija 1.01, 2021-02-22"]
[null,null,null,"Qi",null,{"$f":"F40","v":""},{"$f":"G40","v":""},"","","","","","","",""]
[null,null,null,{"$f":"IF(VLOOKUP($C$11,formules!$A$2:$AP82,18,FALSE)=0,\"\",VLOOKUP($C$11,formules!$A$2:$AP82,18,FALSE))","v":""},null,{"$f":"IFERROR(IF($D42=\"Ui\",formules!F77,IF($D42=\"Log(Pi/Pmažiausia)\",ROUND(LOG(F11/MIN(P)),3),IF($D42=\"ĮVERTkaina\",(COUNT(P)-RANK(OFFSET(P,0,formules!B$63),P,1))/(COUNT(P)-1),\"\"))),\"\")","v":""},{"$f":"IFERROR(IF($D42=\"Ui\",formules!G77,IF($D42=\"Log(Pi/Pmažiausia)\",ROUND(LOG(G11/MIN(P)),3),IF($D42=\"ĮVERTkaina\",(COUNT(P)-RANK(OFFSET(P,0,formules!C$63),P,1))/(COUNT(P)-1),\"\"))),\"\")","v":""},{"$f":"IFERROR(IF($D42=\"Ui\",formules!H77,IF($D42=\"Log(Pi/Pmažiausia)\",ROUND(LOG(H11/MIN(P)),3),IF($D42=\"ĮVERTkaina\",(COUNT(P)-RANK(OFFSET(P,0,formules!D$63),P,1))/(COUNT(P)-1),\"\"))),\"\")","v":""},{"$f":"IFERROR(IF($D42=\"Ui\",formules!I77,IF($D42=\"Log(Pi/Pmažiausia)\",ROUND(LOG(I11/MIN(P)),3),IF($D42=\"ĮVERTkaina\",(COUNT(P)-RANK(OFFSET(P,0,formules!E$63),P,1))/(COUNT(P)-1),\"\"))),\"\")","v":""},{"$f":"IFERROR(IF($D42=\"Ui\",formules!J77,IF($D42=\"Log(Pi/Pmažiausia)\",ROUND(LOG(J11/MIN(P)),3),IF($D42=\"ĮVERTkaina\",(COUNT(P)-RANK(OFFSET(P,0,formules!F$63),P,1))/(COUNT(P)-1),\"\"))),\"\")","v":""},{"$f":"IFERROR(IF($D42=\"Ui\",formules!K77,IF($D42=\"Log(Pi/Pmažiausia)\",ROUND(LOG(K11/MIN(P)),3),IF($D42=\"ĮVERTkaina\",(COUNT(P)-RANK(OFFSET(P,0,formules!G$63),P,1))/(COUNT(P)-1),\"\"))),\"\")","v":""},{"$f":"IFERROR(IF($D42=\"Ui\",formules!L77,IF($D42=\"Log(Pi/Pmažiausia)\",ROUND(LOG(L11/MIN(P)),3),IF($D42=\"ĮVERTkaina\",(COUNT(P)-RANK(OFFSET(P,0,formules!H$63),P,1))/(COUNT(P)-1),\"\"))),\"\")","v":""},{"$f":"IFERROR(IF($D42=\"Ui\",formules!M77,IF($D42=\"Log(Pi/Pmažiausia)\",ROUND(LOG(M11/MIN(P)),3),IF($D42=\"ĮVERTkaina\",(COUNT(P)-RANK(OFFSET(P,0,formules!I$63),P,1))/(COUNT(P)-1),\"\"))),\"\")","v":""},{"$f":"IFERROR(IF($D42=\"Ui\",formules!N77,IF($D42=\"Log(Pi/Pmažiausia)\",ROUND(LOG(N11/MIN(P)),3),IF($D42=\"ĮVERTkaina\",(COUNT(P)-RANK(OFFSET(P,0,formules!J$63),P,1))/(COUNT(P)-1),\"\"))),\"\")","v":""},{"$f":"IFERROR(IF($D42=\"Ui\",formules!O77,IF($D42=\"Log(Pi/Pmažiausia)\",ROUND(LOG(O11/MIN(P)),3),IF($D42=\"ĮVERTkaina\",(COUNT(P)-RANK(OFFSET(P,0,formules!K$63),P,1))/(COUNT(P)-1),\"\"))),\"\")","v":""},{"$f":"IF(P40=version!A2,1,0)","v":0}]
[null,null,null,{"$f":"IF(D42=\"Ui\",\"BBi\",\"\")","v":""},null,{"$f":"IFERROR(IF($D$43=\"BBi\",formules!F78,\"\"),\"\")","v":""},{"$f":"IFERROR(IF($D$43=\"BBi\",formules!G78,\"\"),\"\")","v":""},{"$f":"IFERROR(IF($D$43=\"BBi\",formules!H78,\"\"),\"\")","v":""},{"$f":"IFERROR(IF($D$43=\"BBi\",formules!I78,\"\"),\"\")","v":""},{"$f":"IFERROR(IF($D$43=\"BBi\",formules!J78,\"\"),\"\")","v":""},{"$f":"IFERROR(IF($D$43=\"BBi\",formules!K78,\"\"),\"\")","v":""},{"$f":"IFERROR(IF($D$43=\"BBi\",formules!L78,\"\"),\"\")","v":""},{"$f":"IFERROR(IF($D$43=\"BBi\",formules!M78,\"\"),\"\")","v":""},{"$f":"IFERROR(IF($D$43=\"BBi\",formules!N78,\"\"),\"\")","v":""},{"$f":"IFERROR(IF($D$43=\"BBi\",formules!O78,\"\"),\"\")","v":""}]

{"sheet":"formules","index":3,"n_rows":103,"n_cols":42,"rows_kept":103,"cut":false,"hidden":true,"merged":[[54,3,54,4],[0,0,0,15],[51,0,51,1],[51,3,51,4],[52,3,52,4],[53,3,53,4]]}
["BALAI PAGAL ATSKIRAS FORMULES",null,null,null,null,null,null,null,null,null,null,null,null,null,null,null,null,null,null,null,"R","IND","INF",2,3,4,"!","!!","PARETO","LOW/HIGH","MUST MAX","Must min price","Qref","Pref","N","Text Q","Text P","INFPERC","!2017","!!2017",null,"Naudojamas svoris"]
["1.1. Argitek (Absoliutinė)",null,17,1,null,{"$f":"IFERROR(OFFSET(P,0,formules!B$63)/(POWER(OFFSET(Qx,0,formules!B$63),(WQ/WP))),\"\")","v":""},{"$f":"IFERROR(OFFSET(P,0,formules!C$63)/(POWER(OFFSET(Qx,0,formules!C$63),(WQ/WP))),\"\")","v":""},{"$f":"IFERROR(OFFSET(P,0,formules!D$63)/(POWER(OFFSET(Qx,0,formules!D$63),(WQ/WP))),\"\")","v":""},{"$f":"IFERROR(OFFSET(P,0,formules!E$63)/(POWER(OFFSET(Qx,0,formules!E$63),(WQ/WP))),\"\")","v":""},{"$f":"IFERROR(OFFSET(P,0,formules!F$63)/(POWER(OFFSET(Qx,0,formules!F$63),(WQ/WP))),\"\")","v":""},{"$f":"IFERROR(OFFSET(P,0,formules!G$63)/(POWER(OFFSET(Qx,0,formules!G$63),(WQ/WP))),\"\")","v":""},{"$f":"IFERROR(OFFSET(P,0,formules!H$63)/(POWER(OFFSET(Qx,0,formules!H$63),(WQ/WP))),\"\")","v":""},{"$f":"IFERROR(OFFSET(P,0,formules!I$63)/(POWER(OFFSET(Qx,0,formules!I$63),(WQ/WP))),\"\")","v":""},{"$f":"IFERROR(OFFSET(P,0,formules!J$63)/(POWER(OFFSET(Qx,0,formules!J$63),(WQ/WP))),\"\")","v":""},{"$f":"IFERROR(OFFSET(P,0,formules!K$63)/(POWER(OFFSET(Qx,0,formules!K$63),(WQ/WP))),\"\")","v":""},null,{"$f":"\"Wkokybė=\"&WQ&\"; Wkaina=\"&WP","v":"Wkokybė=35; Wkaina=65"},null,"z",null,2,4,1,2.8E-3,0,0,0,0,0,1,null,null,null,null,null,null,null,2.6200000000000001E-2,0,0,17]
["1.2. Telgen  (Absoliutinė)",null,18,1,null,{"$f":"IFERROR(OFFSET(Q,0,formules!B$63)+WP*((pmax-OFFSET(P,0,formules!B$63))/(pmax-pmin)),\"\")","v":""},{"$f":"IFERROR(OFFSET(Q,0,formules!C$63)+WP*((pmax-OFFSET(P,0,formules!C$63))/(pmax-pmin)),\"\")","v":""},{"$f":"IFERROR(OFFSET(Q,0,formules!D$63)+WP*((pmax-OFFSET(P,0,formules!D$63))/(pmax-pmin)),\"\")","v":""},{"$f":"IFERROR(OFFSET(Q,0,formules!E$63)+WP*((pmax-OFFSET(P,0,formules!E$63))/(pmax-pmin)),\"\")","v":""},{"$f":"IFERROR(OFFSET(Q,0,formules!F$63)+WP*((pmax-OFFSET(P,0,formules!F$63))/(pmax-pmin)),\"\")","v":""},{"$f":"IFERROR(OFFSET(Q,0,formules!G$63)+WP*((pmax-OFFSET(P,0,formules!G$63))/(pmax-pmin)),\"\")","v":""},{"$f":"IFERROR(OFFSET(Q,0,formules!H$63)+WP*((pmax-OFFSET(P,0,formules!H$63))/(pmax-pmin)),\"\")","v":""},{"$f":"IFERROR(OFFSET(Q,0,formules!I$63)+WP*((pmax-OFFSET(P,0,formules!I$63))/(pmax-pmin)),\"\")","v":""},{"$f":"IFERROR(OFFSET(Q,0,formules!J$63)+WP*((pmax-OFFSET(P,0,formules!J$63))/(pmax-pmin)),\"\")","v":""},{"$f":"IFERROR(OFFSET(Q,0,formules!K$63)+WP*((pmax-OFFSET(P,0,formules!K$63))/(pmax-pmin)),\"\")","v":""},null,{"$f":"\"Psetmax=\"&pmax&\"€; Psetmin=\"&pmin&\"€; Wkokybė=\"&WQ&\"; Wkaina=\"&WP","v":"Psetmax=200860€; Psetmin=0€; Wkokybė=35; Wkaina=65"},null,null,null,2,2,1,"N/A","N/A","N/A",0,0,"N/A",null,1,1,null,null,null,null,null,"N/A",0,0,18]
["1.3. Kuiper 1  (Absoliutinė)",null,24,1,"+",{"$f":"IFERROR(OFFSET(P,0,formules!B$63)-(WQ/WP)*pref*(1-((qmin/100)/OFFSET(Qx,0,formules!B$63))),\"\")","v":""},{"$f":"IFERROR(OFFSET(P,0,formules!C$63)-(WQ/WP)*pref*(1-((qmin/100)/OFFSET(Qx,0,formules!C$63))),\"\")","v":""},{"$f":"IFERROR(OFFSET(P,0,formules!D$63)-(WQ/WP)*pref*(1-((qmin/100)/OFFSET(Qx,0,formules!D$63))),\"\")","v":""},{"$f":"IFERROR(OFFSET(P,0,formules!E$63)-(WQ/WP)*pref*(1-((qmin/100)/OFFSET(Qx,0,formules!E$63))),\"\")","v":""},{"$f":"IFERROR(OFFSET(P,0,formules!F$63)-(WQ/WP)*pref*(1-((qmin/100)/OFFSET(Qx,0,formules!F$63))),\"\")","v":""},{"$f":"IFERROR(OFFSET(P,0,formules!G$63)-(WQ/WP)*pref*(1-((qmin/100)/OFFSET(Qx,0,formules!G$63))),\"\")","v":""},{"$f":"IFERROR(OFFSET(P,0,formules!H$63)-(WQ/WP)*pref*(1-((qmin/100)/OFFSET(Qx,0,formules!H$63))),\"\")","v":""},{"$f":"IFERROR(OFFSET(P,0,formules!I$63)-(WQ/WP)*pref*(1-((qmin/100)/OFFSET(Qx,0,formules!I$63))),\"\")","v":""},{"$f":"IFERROR(OFFSET(P,0,formules!J$63)-(WQ/WP)*pref*(1-((qmin/100)/OFFSET(Qx,0,formules!J$63))),\"\")","v":""},{"$f":"IFERROR(OFFSET(P,0,formules!K$63)-(WQ/WP)*pref*(1-((qmin/100)/OFFSET(Qx,0,formules!K$63))),\"\")","v":""},null,{"$f":"\"Qref=\"&qmin&\"% (arba \"&qmin/100&\"); Pref=\"&pref&\"€\"&\"; Wkokybė=\"&WQ&\"; Wkaina=\"&WP","v":"Qref=2% (arba 0,02); Pref=5€; Wkokybė=35; Wkaina=65"},null,"z",null,2,3,1,"N/A","N/A","N/A",0,0,"N/A",1,null,null,1,1,null,"Qref","Pref","n/A",0,0,24]
["1.4. Kuiper 2  (Absoliutinė)",null,25,1,null,{"$f":"IFERROR(((OFFSET(Qx,0,formules!B$63)*WQ)/(OFFSET(P,0,formules!B$63)*WP)),\"\")","v":""},{"$f":"IFERROR(((OFFSET(Qx,0,formules!C$63)*WQ)/(OFFSET(P,0,formules!C$63)*WP)),\"\")","v":""},{"$f":"IFERROR(((OFFSET(Qx,0,formules!D$63)*WQ)/(OFFSET(P,0,formules!D$63)*WP)),\"\")","v":""},{"$f":"IFERROR(((OFFSET(Qx,0,formules!E$63)*WQ)/(OFFSET(P,0,formules!E$63)*WP)),\"\")","v":""},{"$f":"IFERROR(((OFFSET(Qx,0,formules!F$63)*WQ)/(OFFSET(P,0,formules!F$63)*WP)),\"\")","v":""},{"$f":"IFERROR(((OFFSET(Qx,0,formules!G$63)*WQ)/(OFFSET(P,0,formules!G$63)*WP)),\"\")","v":""},{"$f":"IFERROR(((OFFSET(Qx,0,formules!H$63)*WQ)/(OFFSET(P,0,formules!H$63)*WP)),\"\")","v":""},{"$f":"IFERROR(((OFFSET(Qx,0,formules!I$63)*WQ)/(OFFSET(P,0,formules!I$63)*WP)),\"\")","v":""},{"$f":"IFERROR(((OFFSET(Qx,0,formules!J$63)*WQ)/(OFFSET(P,0,formules!J$63)*WP)),\"\")","v":""},{"$f":"IFERROR(((OFFSET(Qx,0,formules!K$63)*WQ)/(OFFSET(P,0,formules!K$63)*WP)),\"\")","v":""},null,{"$f":"\" Wkokybė=\"&WQ&\"; Wkaina=\"&WP","v":" Wkokybė=35; Wkaina=65"},null,"z",null,2,2,1,1.7600000000000001E-2,1.8100000000000002E-2,5.7000000000000002E-3,0,0,0,null,null,null,null,null,null,null,null,1.5699999999999999E-2,0,0,25]
["1.5. Kuiper 3  (Absoliutinė)",null,26,1,null,{"$f":"IFERROR(OFFSET(Qx,0,formules!B$63)/(qmin/100)*WQ+WP*(2-(OFFSET(P,0,formules!B$63)/pref)),\"\")","v":""},{"$f":"IFERROR(OFFSET(Qx,0,formules!C$63)/(qmin/100)*WQ+WP*(2-(OFFSET(P,0,formules!C$63)/pref)),\"\")","v":""},{"$f":"IFERROR(OFFSET(Qx,0,formules!D$63)/(qmin/100)*WQ+WP*(2-(OFFSET(P,0,formules!D$63)/pref)),\"\")","v":""},{"$f":"IFERROR(OFFSET(Qx,0,formules!E$63)/(qmin/100)*WQ+WP*(2-(OFFSET(P,0,formules!E$63)/pref)),\"\")","v":""},{"$f":"IFERROR(OFFSET(Qx,0,formules!F$63)/(qmin/100)*WQ+WP*(2-(OFFSET(P,0,formules!F$63)/pref)),\"\")","v":""},{"$f":"IFERROR(OFFSET(Qx,0,formules!G$63)/(qmin/100)*WQ+WP*(2-(OFFSET(P,0,formules!G$63)/pref)),\"\")","v":""},{"$f":"IFERROR(OFFSET(Qx,0,formules!H$63)/(qmin/100)*WQ+WP*(2-(OFFSET(P,0,formules!H$63)/pref)),\"\")","v":""},{"$f":"IFERROR(OFFSET(Qx,0,formules!I$63)/(qmin/100)*WQ+WP*(2-(OFFSET(P,0,formules!I$63)/pref)),\"\")","v":""},{"$f":"IFERROR(OFFSET(Qx,0,formules!J$63)/(qmin/100)*WQ+WP*(2-(OFFSET(P,0,formules!J$63)/pref)),\"\")","v":""},{"$f":"IFERROR(OFFSET(Qx,0,formules!K$63)/(qmin/100)*WQ+WP*(2-(OFFSET(P,0,formules!K$63)/pref)),\"\")","v":""},null,{"$f":"\"Qref=\"&qmin&\"% (arba \"&qmin/100&\"); Pref=\"&pref&\"€\"&\"; Wkokybė=\"&WQ&\"; Wkaina=\"&WP","v":"Qref=2% (arba 0,02); Pref=5€; Wkokybė=35; Wkaina=65"},null,"z",null,2,2,1,"N/A","N/A","N/A",0,0,"N/A",null,null,null,1,1,null,"Qref","Pref","N/A",0,0,26]
["1.6. Kuper superformulė  (Absoliutinė)",null,27,1,null,{"$f":"IFERROR(((POWER(OFFSET(P,0,formules!B$63)/pref,n)+(POWER((1-OFFSET(Qx,0,formules!B$63))/(1-qmin/100),n))))^(1/n),\"\")","v":""},{"$f":"IFERROR(((POWER(OFFSET(P,0,formules!C$63)/pref,n)+(POWER((1-OFFSET(Qx,0,formules!C$63))/(1-qmin/100),n))))^(1/n),\"\")","v":""},{"$f":"IFERROR(((POWER(OFFSET(P,0,formules!D$63)/pref,n)+(POWER((1-OFFSET(Qx,0,formules!D$63))/(1-qmin/100),n))))^(1/n),\"\")","v":""},{"$f":"IFERROR(((POWER(OFFSET(P,0,formules!E$63)/pref,n)+(POWER((1-OFFSET(Qx,0,formules!E$63))/(1-qmin/100),n))))^(1/n),\"\")","v":""},{"$f":"IFERROR(((POWER(OFFSET(P,0,formules!F$63)/pref,n)+(POWER((1-OFFSET(Qx,0,formules!F$63))/(1-qmin/100),n))))^(1/n),\"\")","v":""},{"$f":"IFERROR(((POWER(OFFSET(P,0,formules!G$63)/pref,n)+(POWER((1-OFFSET(Qx,0,formules!G$63))/(1-qmin/100),n))))^(1/n),\"\")","v":""},{"$f":"IFERROR(((POWER(OFFSET(P,0,formules!H$63)/pref,n)+(POWER((1-OFFSET(Qx,0,formules!H$63))/(1-qmin/100),n))))^(1/n),\"\")","v":""},{"$f":"IFERROR(((POWER(OFFSET(P,0,formules!I$63)/pref,n)+(POWER((1-OFFSET(Qx,0,formules!I$63))/(1-qmin/100),n))))^(1/n),\"\")","v":""},{"$f":"IFERROR(((POWER(OFFSET(P,0,formules!J$63)/pref,n)+(POWER((1-OFFSET(Qx,0,formules!J$63))/(1-qmin/100),n))))^(1/n),\"\")","v":""},{"$f":"IFERROR(((POWER(OFFSET(P,0,formules!K$63)/pref,n)+(POWER((1-OFFSET(Qx,0,formules!K$63))/(1-qmin/100),n))))^(1/n),\"\")","v":""},null,{"$f":"\"Q(p=0) =\"&qmin&\"% (arba \"&qmin/100&\"); P(q=1)=\"&pref&\"€\"&\"; n=\"&n","v":"Q(p=0) =2% (arba 0,02); P(q=1)=5€; n=1"},null,"z",null,2,4,1,"N/A","N/A","N/A",0,0,"N/A",1,null,null,1,1,1,"Minimalios kainos kokybė (Qp=0)","Maksimalios kokybės kaina (Pq=1)","N/A",0,0,27,"ne"]
["1.7. Chen 1  (Absoliutinė)",null,14,1,null,{"$f":"IFERROR((WP*OFFSET(P,0,formules!B$63)/pmax)+WQ*(qmin/100)/OFFSET(Qx,0,formules!B$63),\"\")","v":""},{"$f":"IFERROR((WP*OFFSET(P,0,formules!C$63)/pmax)+WQ*(qmin/100)/OFFSET(Qx,0,formules!C$63),\"\")","v":""},{"$f":"IFERROR((WP*OFFSET(P,0,formules!D$63)/pmax)+WQ*(qmin/100)/OFFSET(Qx,0,formules!D$63),\"\")","v":""},{"$f":"IFERROR((WP*OFFSET(P,0,formules!E$63)/pmax)+WQ*(qmin/100)/OFFSET(Qx,0,formules!E$63),\"\")","v":""},{"$f":"IFERROR((WP*OFFSET(P,0,formules!F$63)/pmax)+WQ*(qmin/100)/OFFSET(Qx,0,formules!F$63),\"\")","v":""},{"$f":"IFERROR((WP*OFFSET(P,0,formules!G$63)/pmax)+WQ*(qmin/100)/OFFSET(Qx,0,formules!G$63),\"\")","v":""},{"$f":"IFERROR((WP*OFFSET(P,0,formules!H$63)/pmax)+WQ*(qmin/100)/OFFSET(Qx,0,formules!H$63),\"\")","v":""},{"$f":"IFERROR((WP*OFFSET(P,0,formules!I$63)/pmax)+WQ*(qmin/100)/OFFSET(Qx,0,formules!I$63),\"\")","v":""},{"$f":"IFERROR((WP*OFFSET(P,0,formules!J$63)/pmax)+WQ*(qmin/100)/OFFSET(Qx,0,formules!J$63),\"\")","v":""},{"$f":"IFERROR((WP*OFFSET(P,0,formules!K$63)/pmax)+WQ*(qmin/100)/OFFSET(Qx,0,formules!K$63),\"\")","v":""},null,{"$f":"\"QsetMin=\"&qmin&\"% (arba \"&qmin/100&\"); PSetMax=\"&pmax&\"€\"&\"; Wkokybė=\"&WQ&\"; Wkaina=\"&WP","v":"QsetMin=2% (arba 0,02); PSetMax=200860€; Wkokybė=35; Wkaina=65"},null,"z",null,2,3,1,"N/A","N/A","N/A",0,0,"N/A",1,1,null,1,null,null,"QsetMin",null,"N/A",0,0,14]
["1.8. EMVI  superformulė (Absoliutinė)",null,28,1,null,{"$f":"IFERROR((((POWER(OFFSET(P,0,formules!B$63)/pref,n)+(POWER(2-OFFSET(Qx,0,formules!B$63)/(qmin/100),n))))*0.5)^(1/n),\"\")","v":""},{"$f":"IFERROR((((POWER(OFFSET(P,0,formules!C$63)/pref,n)+(POWER(2-OFFSET(Qx,0,formules!C$63)/(qmin/100),n))))*0.5)^(1/n),\"\")","v":""},{"$f":"IFERROR((((POWER(OFFSET(P,0,formules!D$63)/pref,n)+(POWER(2-OFFSET(Qx,0,formules!D$63)/(qmin/100),n))))*0.5)^(1/n),\"\")","v":""},{"$f":"IFERROR((((POWER(OFFSET(P,0,formules!E$63)/pref,n)+(POWER(2-OFFSET(Qx,0,formules!E$63)/(qmin/100),n))))*0.5)^(1/n),\"\")","v":""},{"$f":"IFERROR((((POWER(OFFSET(P,0,formules!F$63)/pref,n)+(POWER(2-OFFSET(Qx,0,formules!F$63)/(qmin/100),n))))*0.5)^(1/n),\"\")","v":""},{"$f":"IFERROR((((POWER(OFFSET(P,0,formules!G$63)/pref,n)+(POWER(2-OFFSET(Qx,0,formules!G$63)/(qmin/100),n))))*0.5)^(1/n),\"\")","v":""},{"$f":"IFERROR((((POWER(OFFSET(P,0,formules!H$63)/pref,n)+(POWER(2-OFFSET(Qx,0,formules!H$63)/(qmin/100),n))))*0.5)^(1/n),\"\")","v":""},{"$f":"IFERROR((((POWER(OFFSET(P,0,formules!I$63)/pref,n)+(POWER(2-OFFSET(Qx,0,formules!I$63)/(qmin/100),n))))*0.5)^(1/n),\"\")","v":""},{"$f":"IFERROR((((POWER(OFFSET(P,0,formules!J$63)/pref,n)+(POWER(2-OFFSET(Qx,0,formules!J$63)/(qmin/100),n))))*0.5)^(1/n),\"\")","v":""},{"$f":"IFERROR((((POWER(OFFSET(P,0,formules!K$63)/pref,n)+(POWER(2-OFFSET(Qx,0,formules!K$63)/(qmin/100),n))))*0.5)^(1/n),\"\")","v":""},null,{"$f":"\"Qref =\"&qmin&\"% (arba \"&qmin/100&\"); Pref=\"&pref&\"€\"&\"; n=\"&n","v":"Qref =2% (arba 0,02); Pref=5€; n=1"},null,"z",null,2,4,null,"netirta","netirta","netirta",0,0,"netirta",1,null,null,1,1,1,"Pavyzdinė kokybė (50-100 proc), (Qref)","Pavyzdinė kaina (Pref)","netirta",0,0,28,"ne"]
["1.9. Naudos už pinigus (50-50)  (Absoliutinė)",null,29,1,null,{"$f":"IFERROR(OFFSET(Qx,0,formules!B$63)/OFFSET(P,0,formules!B$63)*n*100,\"\")","v":""},{"$f":"IFERROR(OFFSET(Qx,0,formules!C$63)/OFFSET(P,0,formules!C$63)*n*100,\"\")","v":""},{"$f":"IFERROR(OFFSET(Qx,0,formules!D$63)/OFFSET(P,0,formules!D$63)*n*100,\"\")","v":""},{"$f":"IFERROR(OFFSET(Qx,0,formules!E$63)/OFFSET(P,0,formules!E$63)*n*100,\"\")","v":""},{"$f":"IFERROR(OFFSET(Qx,0,formules!F$63)/OFFSET(P,0,formules!F$63)*n*100,\"\")","v":""},{"$f":"IFERROR(OFFSET(Qx,0,formules!G$63)/OFFSET(P,0,formules!G$63)*n*100,\"\")","v":""},{"$f":"IFERROR(OFFSET(Qx,0,formules!H$63)/OFFSET(P,0,formules!H$63)*n*100,\"\")","v":""},{"$f":"IFERROR(OFFSET(Qx,0,formules!I$63)/OFFSET(P,0,formules!I$63)*n*100,\"\")","v":""},{"$f":"IFERROR(OFFSET(Qx,0,formules!J$63)/OFFSET(P,0,formules!J$63)*n*100,\"\")","v":""},{"$f":"IFERROR(OFFSET(Qx,0,formules!K$63)/OFFSET(P,0,formules!K$63)*n*100,\"\")","v":""},null,{"$f":"\"n=\"&n","v":"n=1"},null,"z",null,2,2,null,"netirta","netirta","netirta",0,0,"netirta",null,null,null,null,null,null,null,null,"netirta",0,0,29,"ne"]
["1.10. ISZF  (Absoliutinė)",null,37,1,null,{"$f":"IFERROR(POWER(OFFSET(P,0,formules!B$63),(WP/100))/POWER(OFFSET(Qx,0,formules!B$63),(WQ/100)),\"\")","v":""},{"$f":"IFERROR(POWER(OFFSET(P,0,formules!C$63),(WP/100))/POWER(OFFSET(Qx,0,formules!C$63),(WQ/100)),\"\")","v":""},{"$f":"IFERROR(POWER(OFFSET(P,0,formules!D$63),(WP/100))/POWER(OFFSET(Qx,0,formules!D$63),(WQ/100)),\"\")","v":""},{"$f":"IFERROR(POWER(OFFSET(P,0,formules!E$63),(WP/100))/POWER(OFFSET(Qx,0,formules!E$63),(WQ/100)),\"\")","v":""},{"$f":"IFERROR(POWER(OFFSET(P,0,formules!F$63),(WP/100))/POWER(OFFSET(Qx,0,formules!F$63),(WQ/100)),\"\")","v":""},{"$f":"IFERROR(POWER(OFFSET(P,0,formules!G$63),(WP/100))/POWER(OFFSET(Qx,0,formules!G$63),(WQ/100)),\"\")","v":""},{"$f":"IFERROR(POWER(OFFSET(P,0,formules!H$63),(WP/100))/POWER(OFFSET(Qx,0,formules!H$63),(WQ/100)),\"\")","v":""},{"$f":"IFERROR(POWER(OFFSET(P,0,formules!I$63),(WP/100))/POWER(OFFSET(Qx,0,formules!I$63),(WQ/100)),\"\")","v":""},{"$f":"IFERROR(POWER(OFFSET(P,0,formules!J$63),(WP/100))/POWER(OFFSET(Qx,0,formules!J$63),(WQ/100)),\"\")","v":""},{"$f":"IFERROR(POWER(OFFSET(P,0,formules!K$63),(WP/100))/POWER(OFFSET(Qx,0,formules!K$63),(WQ/100)),\"\")","v":""},null,{"$f":"\"Wkaina=\"&WP/100&\";Wkokybė=\"&WQ/100&\" (žiūrėkite formulės aprašymą)\"","v":"Wkaina=0,65;Wkokybė=0,35 (žiūrėkite formulės aprašymą)"},null,"z",null,2,4,null,"netirta","netirta","netirta",0,0,"netirta",1,null,null,null,null,null,null,null,2.6200000000000001E-2,0,0,"n29"]
["1.11. Mokesčių ir muitinės administracijos S kreivės formulė (Absoliutinė)",null,38,1,null,{"$f":"IFERROR((1-(1/(1+EXP(100*qmin*(pref-OFFSET(P,0,formules!B$63))))))*WP+OFFSET(Q,0,formules!B$63),\"\")","v":""},{"$f":"IFERROR((1-(1/(1+EXP(100*qmin*(pref-OFFSET(P,0,formules!C$63))))))*WP+OFFSET(Q,0,formules!C$63),\"\")","v":""},{"$f":"IFERROR((1-(1/(1+EXP(100*qmin*(pref-OFFSET(P,0,formules!D$63))))))*WP+OFFSET(Q,0,formules!D$63),\"\")","v":""},{"$f":"IFERROR((1-(1/(1+EXP(100*qmin*(pref-OFFSET(P,0,formules!E$63))))))*WP+OFFSET(Q,0,formules!E$63),\"\")","v":""},{"$f":"IFERROR((1-(1/(1+EXP(100*qmin*(pref-OFFSET(P,0,formules!F$63))))))*WP+OFFSET(Q,0,formules!F$63),\"\")","v":""},{"$f":"IFERROR((1-(1/(1+EXP(100*qmin*(pref-OFFSET(P,0,formules!G$63))))))*WP+OFFSET(Q,0,formules!G$63),\"\")","v":""},{"$f":"IFERROR((1-(1/(1+EXP(100*qmin*(pref-OFFSET(P,0,formules!H$63))))))*WP+OFFSET(Q,0,formules!H$63),\"\")","v":""},{"$f":"IFERROR((1-(1/(1+EXP(100*qmin*(pref-OFFSET(P,0,formules!I$63))))))*WP+OFFSET(Q,0,formules!I$63),\"\")","v":""},{"$f":"IFERROR((1-(1/(1+EXP(100*qmin*(pref-OFFSET(P,0,formules!J$63))))))*WP+OFFSET(Q,0,formules!J$63),\"\")","v":""},{"$f":"IFERROR((1-(1/(1+EXP(100*qmin*(pref-OFFSET(P,0,formules!K$63))))))*WP+OFFSET(Q,0,formules!K$63),\"\")","v":""},null,{"$f":"\"Wkokybė=\"&WQ&\"; Wkaina=\"&WP","v":"Wkokybė=35; Wkaina=65"},null,null,null,2,6,null,"netirta","netirta","netirta",0,0,"netirta",null,null,null,1,1,null,"α","β","N/A",0,0,"n30"]
["1.12. Bergman ir Lundberg 1  (Absoliutinė)",null,39,1,null,{"$f":"IFERROR(OFFSET(P,0,formules!B$63)+pref*(qmin-OFFSET(Q,0,formules!B$63)),\"\")","v":""},{"$f":"IFERROR(OFFSET(P,0,formules!C$63)+pref*(qmin-OFFSET(Q,0,formules!C$63)),\"\")","v":""},{"$f":"IFERROR(OFFSET(P,0,formules!D$63)+pref*(qmin-OFFSET(Q,0,formules!D$63)),\"\")","v":""},{"$f":"IFERROR(OFFSET(P,0,formules!E$63)+pref*(qmin-OFFSET(Q,0,formules!E$63)),\"\")","v":""},{"$f":"IFERROR(OFFSET(P,0,formules!F$63)+pref*(qmin-OFFSET(Q,0,formules!F$63)),\"\")","v":""},{"$f":"IFERROR(OFFSET(P,0,formules!G$63)+pref*(qmin-OFFSET(Q,0,formules!G$63)),\"\")","v":""},{"$f":"IFERROR(OFFSET(P,0,formules!H$63)+pref*(qmin-OFFSET(Q,0,formules!H$63)),\"\")","v":""},{"$f":"IFERROR(OFFSET(P,0,formules!I$63)+pref*(qmin-OFFSET(Q,0,formules!I$63)),\"\")","v":""},{"$f":"IFERROR(OFFSET(P,0,formules!J$63)+pref*(qmin-OFFSET(Q,0,formules!J$63)),\"\")","v":""},{"$f":"IFERROR(OFFSET(P,0,formules!K$63)+pref*(qmin-OFFSET(Q,0,formules!K$63)),\"\")","v":""},null,{"$f":"\"Qsetmax=\"&qmin&\" BALŲ; b=\"&pref&\"€\"","v":"Qsetmax=2 BALŲ; b=5€"},null,"n",null,2,2,null,"netirta","netirta","netirta",0,0,"netirta",1,null,null,1,1,null,"Qsetmax","b (€)","N/A",0,0,"n36","ne"]
["1.13. Bergman ir Lundberg 2",null,40,1,null,{"$f":"IFERROR(OFFSET(P,0,formules!B$63)*(1-(pref/100)*OFFSET(Q,0,formules!B$63)),\"\")","v":""},{"$f":"IFERROR(OFFSET(P,0,formules!C$63)*(1-(pref/100)*OFFSET(Q,0,formules!C$63)),\"\")","v":""},{"$f":"IFERROR(OFFSET(P,0,formules!D$63)*(1-(pref/100)*OFFSET(Q,0,formules!D$63)),\"\")","v":""},{"$f":"IFERROR(OFFSET(P,0,formules!E$63)*(1-(pref/100)*OFFSET(Q,0,formules!E$63)),\"\")","v":""},{"$f":"IFERROR(OFFSET(P,0,formules!F$63)*(1-(pref/100)*OFFSET(Q,0,formules!F$63)),\"\")","v":""},{"$f":"IFERROR(OFFSET(P,0,formules!G$63)*(1-(pref/100)*OFFSET(Q,0,formules!G$63)),\"\")","v":""},{"$f":"IFERROR(OFFSET(P,0,formules!H$63)*(1-(pref/100)*OFFSET(Q,0,formules!H$63)),\"\")","v":""},{"$f":"IFERROR(OFFSET(P,0,formules!I$63)*(1-(pref/100)*OFFSET(Q,0,formules!I$63)),\"\")","v":""},{"$f":"IFERROR(OFFSET(P,0,formules!J$63)*(1-(pref/100)*OFFSET(Q,0,formules!J$63)),\"\")","v":""},{"$f":"IFERROR(OFFSET(P,0,formules!K$63)*(1-(pref/100)*OFFSET(Q,0,formules!K$63)),\"\")","v":""},null,{"$f":"\"b=\"&pref&\"% (arba \"&pref/100&\") \"","v":"b=5% (arba 0,05) "},null,"n",null,2,1,null,"netirta","netirta","netirta",0,0,"netirta",1,null,null,null,1,null,null,"b%","N/A",0,0,"n37","ne"]
["1.14. Bergman ir Lundberg 3  (Absoliutinė)",null,41,1,null,{"$f":"IFERROR(OFFSET(P,0,formules!B$63)*(1-(pref/100)*(OFFSET(Q,0,formules!B$63)-qmin)),\"\")","v":""},{"$f":"IFERROR(OFFSET(P,0,formules!C$63)*(1-(pref/100)*(OFFSET(Q,0,formules!C$63)-qmin)),\"\")","v":""},{"$f":"IFERROR(OFFSET(P,0,formules!D$63)*(1-(pref/100)*(OFFSET(Q,0,formules!D$63)-qmin)),\"\")","v":""},{"$f":"IFERROR(OFFSET(P,0,formules!E$63)*(1-(pref/100)*(OFFSET(Q,0,formules!E$63)-qmin)),\"\")","v":""},{"$f":"IFERROR(OFFSET(P,0,formules!F$63)*(1-(pref/100)*(OFFSET(Q,0,formules!F$63)-qmin)),\"\")","v":""},{"$f":"IFERROR(OFFSET(P,0,formules!G$63)*(1-(pref/100)*(OFFSET(Q,0,formules!G$63)-qmin)),\"\")","v":""},{"$f":"IFERROR(OFFSET(P,0,formules!H$63)*(1-(pref/100)*(OFFSET(Q,0,formules!H$63)-qmin)),\"\")","v":""},{"$f":"IFERROR(OFFSET(P,0,formules!I$63)*(1-(pref/100)*(OFFSET(Q,0,formules!I$63)-qmin)),\"\")","v":""},{"$f":"IFERROR(OFFSET(P,0,formules!J$63)*(1-(pref/100)*(OFFSET(Q,0,formules!J$63)-qmin)),\"\")","v":""},{"$f":"IFERROR(OFFSET(P,0,formules!K$63)*(1-(pref/100)*(OFFSET(Q,0,formules!K$63)-qmin)),\"\")","v":""},null,{"$f":"\"QsetMax=\"&qmin&\"BALŲ; b=\"&pref&\"% (arba \"&pref/100&\") \"","v":"QsetMax=2BALŲ; b=5% (arba 0,05) "},null,"n",null,2,1,null,"netirta","netirta","netirta",0,0,"netirta",1,null,null,1,1,null,"QsetMax","b%","N/A",0,0,"n38","ne"]
["1.15. PSIBouw formulė",null,42,1,null,{"$f":"IFERROR(OFFSET(P,0,formules!B$63)-(pref*OFFSET(Q,0,formules!B$63)),\"\")","v":""},{"$f":"IFERROR(OFFSET(P,0,formules!C$63)-(pref*OFFSET(Q,0,formules!C$63)),\"\")","v":""},{"$f":"IFERROR(OFFSET(P,0,formules!D$63)-(pref*OFFSET(Q,0,formules!D$63)),\"\")","v":""},{"$f":"IFERROR(OFFSET(P,0,formules!E$63)-(pref*OFFSET(Q,0,formules!E$63)),\"\")","v":""},{"$f":"IFERROR(OFFSET(P,0,formules!F$63)-(pref*OFFSET(Q,0,formules!F$63)),\"\")","v":""},{"$f":"IFERROR(OFFSET(P,0,formules!G$63)-(pref*OFFSET(Q,0,formules!G$63)),\"\")","v":""},{"$f":"IFERROR(OFFSET(P,0,formules!H$63)-(pref*OFFSET(Q,0,formules!H$63)),\"\")","v":""},{"$f":"IFERROR(OFFSET(P,0,formules!I$63)-(pref*OFFSET(Q,0,formules!I$63)),\"\")","v":""},{"$f":"IFERROR(OFFSET(P,0,formules!J$63)-(pref*OFFSET(Q,0,formules!J$63)),\"\")","v":""},{"$f":"IFERROR(OFFSET(P,0,formules!K$63)-(pref*OFFSET(Q,0,formules!K$63)),\"\")","v":""},null,{"$f":"\"b=\"&pref&\"€\"","v":"b=5€"},null,"n",null,2,2,null,null,null,null,null,null,null,1,null,null,null,1,null,null,"b (€)"]
["2.1. Log formulė",null,30,2,null,{"$f":"IFERROR(OFFSET(Q,0,formules!B$63)+(WP-WP*LOG(OFFSET(P,0,formules!B$63)/MIN(P))/LOG(n)),\"\")","v":""},{"$f":"IFERROR(OFFSET(Q,0,formules!C$63)+(WP-WP*LOG(OFFSET(P,0,formules!C$63)/MIN(P))/LOG(n)),\"\")","v":""},{"$f":"IFERROR(OFFSET(Q,0,formules!D$63)+(WP-WP*LOG(OFFSET(P,0,formules!D$63)/MIN(P))/LOG(n)),\"\")","v":""},{"$f":"IFERROR(OFFSET(Q,0,formules!E$63)+(WP-WP*LOG(OFFSET(P,0,formules!E$63)/MIN(P))/LOG(n)),\"\")","v":""},{"$f":"IFERROR(OFFSET(Q,0,formules!F$63)+(WP-WP*LOG(OFFSET(P,0,formules!F$63)/MIN(P))/LOG(n)),\"\")","v":""},{"$f":"IFERROR(OFFSET(Q,0,formules!G$63)+(WP-WP*LOG(OFFSET(P,0,formules!G$63)/MIN(P))/LOG(n)),\"\")","v":""},{"$f":"IFERROR(OFFSET(Q,0,formules!H$63)+(WP-WP*LOG(OFFSET(P,0,formules!H$63)/MIN(P))/LOG(n)),\"\")","v":""},{"$f":"IFERROR(OFFSET(Q,0,formules!I$63)+(WP-WP*LOG(OFFSET(P,0,formules!I$63)/MIN(P))/LOG(n)),\"\")","v":""},{"$f":"IFERROR(OFFSET(Q,0,formules!J$63)+(WP-WP*LOG(OFFSET(P,0,formules!J$63)/MIN(P))/LOG(n)),\"\")","v":""},{"$f":"IFERROR(OFFSET(Q,0,formules!K$63)+(WP-WP*LOG(OFFSET(P,0,formules!K$63)/MIN(P))/LOG(n)),\"\")","v":""},null,{"$f":"\"n=\"&n&\"; log(n)=\"&ROUND(LOG(n),3)&\"; Wkokybė=\"&WQ&\"; Wkaina=\"&WP","v":"n=1; log(n)=0; Wkokybė=35; Wkaina=65"},"Log(Pi/Pmažiausia)",null,null,2,1,null,"netirta","netirta","netirta","netirta","netirta","netirta",null,null,null,null,null,1,null,null,"netirta","netirta","netirta",30]
["2.2. Mažiausios kainos pasiūlymo",null,1,2,null,{"$f":"IFERROR(WQ*OFFSET(Qx,0,formules!B$63)+WP*MIN(P)/OFFSET(P,0,formules!B$63),\"\")","v":""},{"$f":"IFERROR(WQ*OFFSET(Qx,0,formules!C$63)+WP*MIN(P)/OFFSET(P,0,formules!C$63),\"\")","v":""},{"$f":"IFERROR(WQ*OFFSET(Qx,0,formules!D$63)+WP*MIN(P)/OFFSET(P,0,formules!D$63),\"\")","v":""},{"$f":"IFERROR(WQ*OFFSET(Qx,0,formules!E$63)+WP*MIN(P)/OFFSET(P,0,formules!E$63),\"\")","v":""},{"$f":"IFERROR(WQ*OFFSET(Qx,0,formules!F$63)+WP*MIN(P)/OFFSET(P,0,formules!F$63),\"\")","v":""},{"$f":"IFERROR(WQ*OFFSET(Qx,0,formules!G$63)+WP*MIN(P)/OFFSET(P,0,formules!G$63),\"\")","v":""},{"$f":"IFERROR(WQ*OFFSET(Qx,0,formules!H$63)+WP*MIN(P)/OFFSET(P,0,formules!H$63),\"\")","v":""},{"$f":"IFERROR(WQ*OFFSET(Qx,0,formules!I$63)+WP*MIN(P)/OFFSET(P,0,formules!I$63),\"\")","v":""},{"$f":"IFERROR(WQ*OFFSET(Qx,0,formules!J$63)+WP*MIN(P)/OFFSET(P,0,formules!J$63),\"\")","v":""},{"$f":"IFERROR(WQ*OFFSET(Qx,0,formules!K$63)+WP*MIN(P)/OFFSET(P,0,formules!K$63),\"\")","v":""},null,{"$f":"\"Pmažiausia=\"&MIN(P)&\"€; Wkokybė=\"&WQ&\"; Wkaina=\"&WP","v":"Pmažiausia=0€; Wkokybė=35; Wkaina=65"},null,null,null,1,1,1,0,0,0,0,8.0000000000000004E-4,0,null,null,null,null,null,null,null,null,0.1047,1.9E-2,6.9999999999999999E-4,1]
["2.3. Brangiausio - pigiausio pasiūlymo",null,2,null,null,{"$f":"IFERROR(IFERROR(OFFSET(Q,0,formules!B$63)+WP*((MAX(P)-OFFSET(P,0,formules!B$63))/(MAX(P)-MIN(P))),OFFSET(Q,0,formules!B$63)+WP),\"\")","v":""},{"$f":"IFERROR(IFERROR(OFFSET(Q,0,formules!C$63)+WP*((MAX(P)-OFFSET(P,0,formules!C$63))/(MAX(P)-MIN(P))),OFFSET(Q,0,formules!C$63)+WP),\"\")","v":""},{"$f":"IFERROR(IFERROR(OFFSET(Q,0,formules!D$63)+WP*((MAX(P)-OFFSET(P,0,formules!D$63))/(MAX(P)-MIN(P))),OFFSET(Q,0,formules!D$63)+WP),\"\")","v":""},{"$f":"IFERROR(IFERROR(OFFSET(Q,0,formules!E$63)+WP*((MAX(P)-OFFSET(P,0,formules!E$63))/(MAX(P)-MIN(P))),OFFSET(Q,0,formules!E$63)+WP),\"\")","v":""},{"$f":"IFERROR(IFERROR(OFFSET(Q,0,formules!F$63)+WP*((MAX(P)-OFFSET(P,0,formules!F$63))/(MAX(P)-MIN(P))),OFFSET(Q,0,formules!F$63)+WP),\"\")","v":""},{"$f":"IFERROR(IFERROR(OFFSET(Q,0,formules!G$63)+WP*((MAX(P)-OFFSET(P,0,formules!G$63))/(MAX(P)-MIN(P))),OFFSET(Q,0,formules!G$63)+WP),\"\")","v":""},{"$f":"IFERROR(IFERROR(OFFSET(Q,0,formules!H$63)+WP*((MAX(P)-OFFSET(P,0,formules!H$63))/(MAX(P)-MIN(P))),OFFSET(Q,0,formules!H$63)+WP),\"\")","v":""},{"$f":"IFERROR(IFERROR(OFFSET(Q,0,formules!I$63)+WP*((MAX(P)-OFFSET(P,0,formules!I$63))/(MAX(P)-MIN(P))),OFFSET(Q,0,formules!I$63)+WP),\"\")","v":""},{"$f":"IFERROR(IFERROR(OFFSET(Q,0,formules!J$63)+WP*((MAX(P)-OFFSET(P,0,formules!J$63))/(MAX(P)-MIN(P))),OFFSET(Q,0,formules!J$63)+WP),\"\")","v":""},{"$f":"IFERROR(IFERROR(OFFSET(Q,0,formules!K$63)+WP*((MAX(P)-OFFSET(P,0,formules!K$63))/(MAX(P)-MIN(P))),OFFSET(Q,0,formules!K$63)+WP),\"\")","v":""},null,{"$f":"\"Pmažiausia=\"&MIN(P)&\"€; Pdidžiausia=\"&MAX(P)&\"€; Wkokybė=\"&WQ&\"; Wkaina=\"&WP","v":"Pmažiausia=0€; Pdidžiausia=0€; Wkokybė=35; Wkaina=65"},null,null,null,1,5,2,1.7600000000000001E-2,1.8100000000000002E-2,5.7000000000000002E-3,1.0999999999999999E-2,9.1000000000000004E-3,0,null,null,null,null,null,null,null,null,6.8099999999999994E-2,4.1500000000000002E-2,1.6299999999999999E-2,2]
["2.4. Balų vidurkio",null,3,null,null,{"$f":"IFERROR(IFERROR(IF(OFFSET(P,0,formules!B$63)<AVERAGE(P),OFFSET(Q,0,formules!B$63)+WP,OFFSET(Q,0,formules!B$63)+WP*((MAX(P)-OFFSET(P,0,formules!B$63))/(MAX(P)-AVERAGE(P)))),OFFSET(Q,0,formules!B$63)+WP),\"\")","v":""},{"$f":"IFERROR(IFERROR(IF(OFFSET(P,0,formules!C$63)<AVERAGE(P),OFFSET(Q,0,formules!C$63)+WP,OFFSET(Q,0,formules!C$63)+WP*((MAX(P)-OFFSET(P,0,formules!C$63))/(MAX(P)-AVERAGE(P)))),OFFSET(Q,0,formules!C$63)+WP),\"\")","v":""},{"$f":"IFERROR(IFERROR(IF(OFFSET(P,0,formules!D$63)<AVERAGE(P),OFFSET(Q,0,formules!D$63)+WP,OFFSET(Q,0,formules!D$63)+WP*((MAX(P)-OFFSET(P,0,formules!D$63))/(MAX(P)-AVERAGE(P)))),OFFSET(Q,0,formules!D$63)+WP),\"\")","v":""},{"$f":"IFERROR(IFERROR(IF(OFFSET(P,0,formules!E$63)<AVERAGE(P),OFFSET(Q,0,formules!E$63)+WP,OFFSET(Q,0,formules!E$63)+WP*((MAX(P)-OFFSET(P,0,formules!E$63))/(MAX(P)-AVERAGE(P)))),OFFSET(Q,0,formules!E$63)+WP),\"\")","v":""},{"$f":"IFERROR(IFERROR(IF(OFFSET(P,0,formules!F$63)<AVERAGE(P),OFFSET(Q,0,formules!F$63)+WP,OFFSET(Q,0,formules!F$63)+WP*((MAX(P)-OFFSET(P,0,formules!F$63))/(MAX(P)-AVERAGE(P)))),OFFSET(Q,0,formules!F$63)+WP),\"\")","v":""},{"$f":"IFERROR(IFERROR(IF(OFFSET(P,0,formules!G$63)<AVERAGE(P),OFFSET(Q,0,formules!G$63)+WP,OFFSET(Q,0,formules!G$63)+WP*((MAX(P)-OFFSET(P,0,formules!G$63))/(MAX(P)-AVERAGE(P)))),OFFSET(Q,0,formules!G$63)+WP),\"\")","v":""},{"$f":"IFERROR(IFERROR(IF(OFFSET(P,0,formules!H$63)<AVERAGE(P),OFFSET(Q,0,formules!H$63)+WP,OFFSET(Q,0,formules!H$63)+WP*((MAX(P)-OFFSET(P,0,formules!H$63))/(MAX(P)-AVERAGE(P)))),OFFSET(Q,0,formules!H$63)+WP),\"\")","v":""},{"$f":"IFERROR(IFERROR(IF(OFFSET(P,0,formules!I$63)<AVERAGE(P),OFFSET(Q,0,formules!I$63)+WP,OFFSET(Q,0,formules!I$63)+WP*((MAX(P)-OFFSET(P,0,formules!I$63))/(MAX(P)-AVERAGE(P)))),OFFSET(Q,0,formules!I$63)+WP),\"\")","v":""},{"$f":"IFERROR(IFERROR(IF(OFFSET(P,0,formules!J$63)<AVERAGE(P),OFFSET(Q,0,formules!J$63)+WP,OFFSET(Q,0,formules!J$63)+WP*((MAX(P)-OFFSET(P,0,formules!J$63))/(MAX(P)-AVERAGE(P)))),OFFSET(Q,0,formules!J$63)+WP),\"\")","v":""},{"$f":"IFERROR(IFERROR(IF(OFFSET(P,0,formules!K$63)<AVERAGE(P),OFFSET(Q,0,formules!K$63)+WP,OFFSET(Q,0,formules!K$63)+WP*((MAX(P)-OFFSET(P,0,formules!K$63))/(MAX(P)-AVERAGE(P)))),OFFSET(Q,0,formules!K$63)+WP),\"\")","v":""},null,{"$f":"\"Pmažiausia=\"&MIN(P)&\"€; Pdidžiausia=\"&MAX(P)&\"€; Wkokybė=\"&WQ&\"; Wkaina=\"&WP&\"; Pvidurkis=\"&AVERAGE(P)","v":{"$error":"#DIV/0!"}},null,null,null,1,5,2,1.17E-2,1.0800000000000001E-2,0,8.7900000000000006E-2,7.5300000000000006E-2,0,null,null,null,null,null,null,null,null,0.75900000000000001,5.4300000000000001E-2,5.4100000000000002E-2,3]
["2.5. Kainos pasiūlymo skirtumo",null,4,null,null,{"$f":"IFERROR(IFERROR(WP*((OFFSET(P,0,formules!B$63)-MAX(P))/(MAX(P)-MIN(P)))-OFFSET(Q,0,formules!B$63),WP-OFFSET(Q,0,formules!B$63)),\"\")","v":""},{"$f":"IFERROR(IFERROR(WP*((OFFSET(P,0,formules!C$63)-MAX(P))/(MAX(P)-MIN(P)))-OFFSET(Q,0,formules!C$63),WP-OFFSET(Q,0,formules!C$63)),\"\")","v":""},{"$f":"IFERROR(IFERROR(WP*((OFFSET(P,0,formules!D$63)-MAX(P))/(MAX(P)-MIN(P)))-OFFSET(Q,0,formules!D$63),WP-OFFSET(Q,0,formules!D$63)),\"\")","v":""},{"$f":"IFERROR(IFERROR(WP*((OFFSET(P,0,formules!E$63)-MAX(P))/(MAX(P)-MIN(P)))-OFFSET(Q,0,formules!E$63),WP-OFFSET(Q,0,formules!E$63)),\"\")","v":""},{"$f":"IFERROR(IFERROR(WP*((OFFSET(P,0,formules!F$63)-MAX(P))/(MAX(P)-MIN(P)))-OFFSET(Q,0,formules!F$63),WP-OFFSET(Q,0,formules!F$63)),\"\")","v":""},{"$f":"IFERROR(IFERROR(WP*((OFFSET(P,0,formules!G$63)-MAX(P))/(MAX(P)-MIN(P)))-OFFSET(Q,0,formules!G$63),WP-OFFSET(Q,0,formules!G$63)),\"\")","v":""},{"$f":"IFERROR(IFERROR(WP*((OFFSET(P,0,formules!H$63)-MAX(P))/(MAX(P)-MIN(P)))-OFFSET(Q,0,formules!H$63),WP-OFFSET(Q,0,formules!H$63)),\"\")","v":""},{"$f":"IFERROR(IFERROR(WP*((OFFSET(P,0,formules!I$63)-MAX(P))/(MAX(P)-MIN(P)))-OFFSET(Q,0,formules!I$63),WP-OFFSET(Q,0,formules!I$63)),\"\")","v":""},{"$f":"IFERROR(IFERROR(WP*((OFFSET(P,0,formules!J$63)-MAX(P))/(MAX(P)-MIN(P)))-OFFSET(Q,0,formules!J$63),WP-OFFSET(Q,0,formules!J$63)),\"\")","v":""},{"$f":"IFERROR(IFERROR(WP*((OFFSET(P,0,formules!K$63)-MAX(P))/(MAX(P)-MIN(P)))-OFFSET(Q,0,formules!K$63),WP-OFFSET(Q,0,formules!K$63)),\"\")","v":""},null,{"$f":"\"Pmažiausia=\"&MIN(P)&\"€; Pdidžiausia=\"&MAX(P)&\"€; Wkokybė=\"&WQ&\"; Wkaina=\"&WP","v":"Pmažiausia=0€; Pdidžiausia=0€; Wkokybė=35; Wkaina=65"},null,null,null,1,5,2,1.7600000000000001E-2,1.8100000000000002E-2,5.7000000000000002E-3,1.0999999999999999E-2,9.1000000000000004E-3,0,1,null,null,null,null,null,null,null,6.8099999999999994E-2,4.1500000000000002E-2,1.6299999999999999E-2,4]
["2.6. Vidutinio pasiūlymo",null,5,null,null,{"$f":"IFERROR(WP*(OFFSET(P,0,formules!B$63)/AVERAGE(P))-OFFSET(Q,0,formules!B$63),\"\")","v":""},{"$f":"IFERROR(WP*(OFFSET(P,0,formules!C$63)/AVERAGE(P))-OFFSET(Q,0,formules!C$63),\"\")","v":""},{"$f":"IFERROR(WP*(OFFSET(P,0,formules!D$63)/AVERAGE(P))-OFFSET(Q,0,formules!D$63),\"\")","v":""},{"$f":"IFERROR(WP*(OFFSET(P,0,formules!E$63)/AVERAGE(P))-OFFSET(Q,0,formules!E$63),\"\")","v":""},{"$f":"IFERROR(WP*(OFFSET(P,0,formules!F$63)/AVERAGE(P))-OFFSET(Q,0,formules!F$63),\"\")","v":""},{"$f":"IFERROR(WP*(OFFSET(P,0,formules!G$63)/AVERAGE(P))-OFFSET(Q,0,formules!G$63),\"\")","v":""},{"$f":"IFERROR(WP*(OFFSET(P,0,formules!H$63)/AVERAGE(P))-OFFSET(Q,0,formules!H$63),\"\")","v":""},{"$f":"IFERROR(WP*(OFFSET(P,0,formules!I$63)/AVERAGE(P))-OFFSET(Q,0,formules!I$63),\"\")","v":""},{"$f":"IFERROR(WP*(OFFSET(P,0,formules!J$63)/AVERAGE(P))-OFFSET(Q,0,formules!J$63),\"\")","v":""},{"$f":"IFERROR(WP*(OFFSET(P,0,formules!K$63)/AVERAGE(P))-OFFSET(Q,0,formules!K$63),\"\")","v":""},null,{"$f":"\"Pvidurkis=\"&AVERAGE(P)&\"€; Wkokybė=\"&WQ&\"; Wkaina=\"&WP","v":{"$error":"#DIV/0!"}},null,null,null,1,2,1,0,0,0,0,5.7000000000000002E-3,0,1,null,null,null,null,null,null,null,1.5699999999999999E-2,1.2699999999999999E-2,4.5999999999999999E-3,5]
["2.7. Didžiausio kainos nuokrypio modelis",null,6,null,null,{"$f":"IFERROR(WP*(1-(OFFSET(P,0,formules!B$63)/MAX(P)))+OFFSET(Q,0,formules!B$63),\"\")","v":""},{"$f":"IFERROR(WP*(1-(OFFSET(P,0,formules!C$63)/MAX(P)))+OFFSET(Q,0,formules!C$63),\"\")","v":""},{"$f":"IFERROR(WP*(1-(OFFSET(P,0,formules!D$63)/MAX(P)))+OFFSET(Q,0,formules!D$63),\"\")","v":""},{"$f":"IFERROR(WP*(1-(OFFSET(P,0,formules!E$63)/MAX(P)))+OFFSET(Q,0,formules!E$63),\"\")","v":""},{"$f":"IFERROR(WP*(1-(OFFSET(P,0,formules!F$63)/MAX(P)))+OFFSET(Q,0,formules!F$63),\"\")","v":""},{"$f":"IFERROR(WP*(1-(OFFSET(P,0,formules!G$63)/MAX(P)))+OFFSET(Q,0,formules!G$63),\"\")","v":""},{"$f":"IFERROR(WP*(1-(OFFSET(P,0,formules!H$63)/MAX(P)))+OFFSET(Q,0,formules!H$63),\"\")","v":""},{"$f":"IFERROR(WP*(1-(OFFSET(P,0,formules!I$63)/MAX(P)))+OFFSET(Q,0,formules!I$63),\"\")","v":""},{"$f":"IFERROR(WP*(1-(OFFSET(P,0,formules!J$63)/MAX(P)))+OFFSET(Q,0,formules!J$63),\"\")","v":""},{"$f":"IFERROR(WP*(1-(OFFSET(P,0,formules!K$63)/MAX(P)))+OFFSET(Q,0,formules!K$63),\"\")","v":""},null,{"$f":"\"Pdidžiausia=\"&MAX(P)&\"€; Wkokybė=\"&WQ&\"; Wkaina=\"&WP","v":"Pdidžiausia=0€; Wkokybė=35; Wkaina=65"},null,null,null,1,2,2,0,0,0,0,8.0000000000000004E-4,0,null,null,null,null,null,null,null,null,6.8099999999999994E-2,0,4.5999999999999999E-3,6]
["2.8. Negometrix",null,7,null,null,{"$f":"IFERROR(F$79,\"\")","v":""},"","","","","","","","","",null,{"$f":"\" Wkokybė=\"&WQ&\"; Wkaina=\"&WP","v":" Wkokybė=35; Wkaina=65"},"Ui","z",null,1,2,1,0,0,0,2.1299999999999999E-2,0,0,1,null,null,null,null,null,null,null,7.0699999999999999E-2,6.3500000000000001E-2,0,7]
["2.9. Koventrio miesto tarybos",null,8,null,"?",{"$f":"IFERROR(WQ*OFFSET(Qx,0,formules!B$63)/MAX(Qx)+(WP*(MIN(P)/OFFSET(P,0,formules!B$63))),\"\")","v":""},{"$f":"IFERROR(WQ*OFFSET(Qx,0,formules!C$63)/MAX(Qx)+(WP*(MIN(P)/OFFSET(P,0,formules!C$63))),\"\")","v":""},{"$f":"IFERROR(WQ*OFFSET(Qx,0,formules!D$63)/MAX(Qx)+(WP*(MIN(P)/OFFSET(P,0,formules!D$63))),\"\")","v":""},{"$f":"IFERROR(WQ*OFFSET(Qx,0,formules!E$63)/MAX(Qx)+(WP*(MIN(P)/OFFSET(P,0,formules!E$63))),\"\")","v":""},{"$f":"IFERROR(WQ*OFFSET(Qx,0,formules!F$63)/MAX(Qx)+(WP*(MIN(P)/OFFSET(P,0,formules!F$63))),\"\")","v":""},{"$f":"IFERROR(WQ*OFFSET(Qx,0,formules!G$63)/MAX(Qx)+(WP*(MIN(P)/OFFSET(P,0,formules!G$63))),\"\")","v":""},{"$f":"IFERROR(WQ*OFFSET(Qx,0,formules!H$63)/MAX(Qx)+(WP*(MIN(P)/OFFSET(P,0,formules!H$63))),\"\")","v":""},{"$f":"IFERROR(WQ*OFFSET(Qx,0,formules!I$63)/MAX(Qx)+(WP*(MIN(P)/OFFSET(P,0,formules!I$63))),\"\")","v":""},{"$f":"IFERROR(WQ*OFFSET(Qx,0,formules!J$63)/MAX(Qx)+(WP*(MIN(P)/OFFSET(P,0,formules!J$63))),\"\")","v":""},{"$f":"IFERROR(WQ*OFFSET(Qx,0,formules!K$63)/MAX(Qx)+(WP*(MIN(P)/OFFSET(P,0,formules!K$63))),\"\")","v":""},null,{"$f":"\"Qdidžiausia=\"&MAX(Qx)*100&\"% (arba \"&MAX(Qx)&\"); Pmažiausia=\"&MIN(P)&\"€; Wkokybė=\"&WQ&\"; Wkaina=\"&WP","v":"Qdidžiausia=0% (arba 0); Pmažiausia=0€; Wkokybė=35; Wkaina=65"},null,"z",null,1,1,2,0,0,0,7.1000000000000004E-3,0,0,null,null,null,null,null,null,null,null,0.15970000000000001,2.5600000000000001E-2,0,8]
["2.10. Cern",null,9,null,"?",{"$f":"IFERROR(WQ*OFFSET(Qx,0,formules!B$63)/MAX(Qx)-0.5*WP*((OFFSET(P,0,formules!B$63)/MIN(P))-1),\"\")","v":""},{"$f":"IFERROR(WQ*OFFSET(Qx,0,formules!C$63)/MAX(Qx)-0.5*WP*((OFFSET(P,0,formules!C$63)/MIN(P))-1),\"\")","v":""},{"$f":"IFERROR(WQ*OFFSET(Qx,0,formules!D$63)/MAX(Qx)-0.5*WP*((OFFSET(P,0,formules!D$63)/MIN(P))-1),\"\")","v":""},{"$f":"IFERROR(WQ*OFFSET(Qx,0,formules!E$63)/MAX(Qx)-0.5*WP*((OFFSET(P,0,formules!E$63)/MIN(P))-1),\"\")","v":""},{"$f":"IFERROR(WQ*OFFSET(Qx,0,formules!F$63)/MAX(Qx)-0.5*WP*((OFFSET(P,0,formules!F$63)/MIN(P))-1),\"\")","v":""},{"$f":"IFERROR(WQ*OFFSET(Qx,0,formules!G$63)/MAX(Qx)-0.5*WP*((OFFSET(P,0,formules!G$63)/MIN(P))-1),\"\")","v":""},{"$f":"IFERROR(WQ*OFFSET(Qx,0,formules!H$63)/MAX(Qx)-0.5*WP*((OFFSET(P,0,formules!H$63)/MIN(P))-1),\"\")","v":""},{"$f":"IFERROR(WQ*OFFSET(Qx,0,formules!I$63)/MAX(Qx)-0.5*WP*((OFFSET(P,0,formules!I$63)/MIN(P))-1),\"\")","v":""},{"$f":"IFERROR(WQ*OFFSET(Qx,0,formules!J$63)/MAX(Qx)-0.5*WP*((OFFSET(P,0,formules!J$63)/MIN(P))-1),\"\")","v":""},{"$f":"IFERROR(WQ*OFFSET(Qx,0,formules!K$63)/MAX(Qx)-0.5*WP*((OFFSET(P,0,formules!K$63)/MIN(P))-1),\"\")","v":""},null,{"$f":"\"Qdidžiausia=\"&MAX(Qx)*100&\"% (arba \"&MAX(Qx)&\"); Pmažiausia=\"&MIN(P)&\"€; Wkokybė=\"&WQ&\"; Wkaina=\"&WP","v":"Qdidžiausia=0% (arba 0); Pmažiausia=0€; Wkokybė=35; Wkaina=65"},null,"z",null,1,2,1,8.3999999999999995E-3,7.1000000000000004E-3,1.1599999999999999E-2,7.1000000000000004E-3,0,0,null,null,null,null,null,null,null,null,5.1999999999999998E-3,2.5399999999999999E-2,2E-3,9]
["2.11.Tennet",null,10,null,null,{"$f":"IFERROR(OFFSET(P,0,formules!B$63)+ (1-(OFFSET(Qx,0,formules!B$63)/MAX(Qx)))*(OFFSET(P,0,formules!B$63)*WQ)/WP,\"\")","v":""},{"$f":"IFERROR(OFFSET(P,0,formules!C$63)+ (1-(OFFSET(Qx,0,formules!C$63)/MAX(Qx)))*(OFFSET(P,0,formules!C$63)*WQ)/WP,\"\")","v":""},{"$f":"IFERROR(OFFSET(P,0,formules!D$63)+ (1-(OFFSET(Qx,0,formules!D$63)/MAX(Qx)))*(OFFSET(P,0,formules!D$63)*WQ)/WP,\"\")","v":""},{"$f":"IFERROR(OFFSET(P,0,formules!E$63)+ (1-(OFFSET(Qx,0,formules!E$63)/MAX(Qx)))*(OFFSET(P,0,formules!E$63)*WQ)/WP,\"\")","v":""},{"$f":"IFERROR(OFFSET(P,0,formules!F$63)+ (1-(OFFSET(Qx,0,formules!F$63)/MAX(Qx)))*(OFFSET(P,0,formules!F$63)*WQ)/WP,\"\")","v":""},{"$f":"IFERROR(OFFSET(P,0,formules!G$63)+ (1-(OFFSET(Qx,0,formules!G$63)/MAX(Qx)))*(OFFSET(P,0,formules!G$63)*WQ)/WP,\"\")","v":""},{"$f":"IFERROR(OFFSET(P,0,formules!H$63)+ (1-(OFFSET(Qx,0,formules!H$63)/MAX(Qx)))*(OFFSET(P,0,formules!H$63)*WQ)/WP,\"\")","v":""},{"$f":"IFERROR(OFFSET(P,0,formules!I$63)+ (1-(OFFSET(Qx,0,formules!I$63)/MAX(Qx)))*(OFFSET(P,0,formules!I$63)*WQ)/WP,\"\")","v":""},{"$f":"IFERROR(OFFSET(P,0,formules!J$63)+ (1-(OFFSET(Qx,0,formules!J$63)/MAX(Qx)))*(OFFSET(P,0,formules!J$63)*WQ)/WP,\"\")","v":""},{"$f":"IFERROR(OFFSET(P,0,formules!K$63)+ (1-(OFFSET(Qx,0,formules!K$63)/MAX(Qx)))*(OFFSET(P,0,formules!K$63)*WQ)/WP,\"\")","v":""},null,{"$f":"\"Qdidžiausia=\"&MAX(Qx)*100&\"% (arba \"&MAX(Qx)&\"); Wkokybė=\"&WQ&\"; Wkaina=\"&WP","v":"Qdidžiausia=0% (arba 0); Wkokybė=35; Wkaina=65"},null,"z",null,1,1,1,1.12E-2,1.0699999999999999E-2,1.1599999999999999E-2,1.0699999999999999E-2,0,0,1,null,null,null,null,null,null,null,5.1999999999999998E-3,0,0,10]
["2.12.Mercer",null,11,null,null,{"$f":"IFERROR(IF((OFFSET(P,0,formules!B$63)-MIN(P))/MIN(P)>1,OFFSET(Q,0,formules!B$63),(OFFSET(Q,0,formules!B$63)+(1-(OFFSET(P,0,formules!B$63)-MIN(P))/MIN(P))*WP)),\"\")","v":""},{"$f":"IFERROR(IF((OFFSET(P,0,formules!C$63)-MIN(P))/MIN(P)>1,OFFSET(Q,0,formules!C$63),(OFFSET(Q,0,formules!C$63)+(1-(OFFSET(P,0,formules!C$63)-MIN(P))/MIN(P))*WP)),\"\")","v":""},{"$f":"IFERROR(IF((OFFSET(P,0,formules!D$63)-MIN(P))/MIN(P)>1,OFFSET(Q,0,formules!D$63),(OFFSET(Q,0,formules!D$63)+(1-(OFFSET(P,0,formules!D$63)-MIN(P))/MIN(P))*WP)),\"\")","v":""},{"$f":"IFERROR(IF((OFFSET(P,0,formules!E$63)-MIN(P))/MIN(P)>1,OFFSET(Q,0,formules!E$63),(OFFSET(Q,0,formules!E$63)+(1-(OFFSET(P,0,formules!E$63)-MIN(P))/MIN(P))*WP)),\"\")","v":""},{"$f":"IFERROR(IF((OFFSET(P,0,formules!F$63)-MIN(P))/MIN(P)>1,OFFSET(Q,0,formules!F$63),(OFFSET(Q,0,formules!F$63)+(1-(OFFSET(P,0,formules!F$63)-MIN(P))/MIN(P))*WP)),\"\")","v":""},{"$f":"IFERROR(IF((OFFSET(P,0,formules!G$63)-MIN(P))/MIN(P)>1,OFFSET(Q,0,formules!G$63),(OFFSET(Q,0,formules!G$63)+(1-(OFFSET(P,0,formules!G$63)-MIN(P))/MIN(P))*WP)),\"\")","v":""},{"$f":"IFERROR(IF((OFFSET(P,0,formules!H$63)-MIN(P))/MIN(P)>1,OFFSET(Q,0,formules!H$63),(OFFSET(Q,0,formules!H$63)+(1-(OFFSET(P,0,formules!H$63)-MIN(P))/MIN(P))*WP)),\"\")","v":""},{"$f":"IFERROR(IF((OFFSET(P,0,formules!I$63)-MIN(P))/MIN(P)>1,OFFSET(Q,0,formules!I$63),(OFFSET(Q,0,formules!I$63)+(1-(OFFSET(P,0,formules!I$63)-MIN(P))/MIN(P))*WP)),\"\")","v":""},{"$f":"IFERROR(IF((OFFSET(P,0,formules!J$63)-MIN(P))/MIN(P)>1,OFFSET(Q,0,formules!J$63),(OFFSET(Q,0,formules!J$63)+(1-(OFFSET(P,0,formules!J$63)-MIN(P))/MIN(P))*WP)),\"\")","v":""},{"$f":"IFERROR(IF((OFFSET(P,0,formules!K$63)-MIN(P))/MIN(P)>1,OFFSET(Q,0,formules!K$63),(OFFSET(Q,0,formules!K$63)+(1-(OFFSET(P,0,formules!K$63)-MIN(P))/MIN(P))*WP)),\"\")","v":""},null,{"$f":"\"Pmažiausia=\"&MIN(P)&\"€; Wkokybė=\"&WQ&\"; Wkaina=\"&WP","v":"Pmažiausia=0€; Wkokybė=35; Wkaina=65"},null,null,null,1,7,2,0,0,0,1.06E-2,0,0,null,null,null,null,null,null,null,null,0.13089999999999999,3.49E-2,0,11]
["2.13.Škotijos vyriausybės formulė",null,12,null,null,{"$f":"IFERROR((0.5-((OFFSET(P,0,formules!B$63)-AVERAGE(P))/AVERAGE(P)))*WP+OFFSET(Q,0,formules!B$63),\"\")","v":""},{"$f":"IFERROR((0.5-((OFFSET(P,0,formules!C$63)-AVERAGE(P))/AVERAGE(P)))*WP+OFFSET(Q,0,formules!C$63),\"\")","v":""},{"$f":"IFERROR((0.5-((OFFSET(P,0,formules!D$63)-AVERAGE(P))/AVERAGE(P)))*WP+OFFSET(Q,0,formules!D$63),\"\")","v":""},{"$f":"IFERROR((0.5-((OFFSET(P,0,formules!E$63)-AVERAGE(P))/AVERAGE(P)))*WP+OFFSET(Q,0,formules!E$63),\"\")","v":""},{"$f":"IFERROR((0.5-((OFFSET(P,0,formules!F$63)-AVERAGE(P))/AVERAGE(P)))*WP+OFFSET(Q,0,formules!F$63),\"\")","v":""},{"$f":"IFERROR((0.5-((OFFSET(P,0,formules!G$63)-AVERAGE(P))/AVERAGE(P)))*WP+OFFSET(Q,0,formules!G$63),\"\")","v":""},{"$f":"IFERROR((0.5-((OFFSET(P,0,formules!H$63)-AVERAGE(P))/AVERAGE(P)))*WP+OFFSET(Q,0,formules!H$63),\"\")","v":""},{"$f":"IFERROR((0.5-((OFFSET(P,0,formules!I$63)-AVERAGE(P))/AVERAGE(P)))*WP+OFFSET(Q,0,formules!I$63),\"\")","v":""},{"$f":"IFERROR((0.5-((OFFSET(P,0,formules!J$63)-AVERAGE(P))/AVERAGE(P)))*WP+OFFSET(Q,0,formules!J$63),\"\")","v":""},{"$f":"IFERROR((0.5-((OFFSET(P,0,formules!K$63)-AVERAGE(P))/AVERAGE(P)))*WP+OFFSET(Q,0,formules!K$63),\"\")","v":""},null,{"$f":"\"Pvidurkis=\"&AVERAGE(P)&\"€; Wkokybė=\"&WQ&\"; Wkaina=\"&WP","v":{"$error":"#DIV/0!"}},null,null,null,1,2,2,null,null,null,null,null,null,null,null,null,null,null,null,null,null,1.5699999999999999E-2,1.2699999999999999E-2,4.5999999999999999E-3,12]
["2.14.Vandentvarkos įmonės \"Brabandse Delta\"",null,13,null,null,{"$f":"IFERROR(IF((sm-MIN(P))/MIN(P)*100>20,IF(OFFSET(P,0,formules!B$63)=sm,0.8*WP+OFFSET(Q,0,formules!B$63),IF(OFFSET(P,0,formules!B$63)=MIN(P),WP+OFFSET(Q,0,formules!B$63),WP*(1-(OFFSET(P,0,formules!B$63)-sm)/sm)+OFFSET(Q,0,formules!B$63))),WP*(1-((OFFSET(P,0,formules!B$63)-MIN(P))/MIN(P)))+OFFSET(Q,0,formules!B$63)),\"\")","v":""},{"$f":"IFERROR(IF((sm-MIN(P))/MIN(P)*100>20,IF(OFFSET(P,0,formules!C$63)=sm,0.8*WP+OFFSET(Q,0,formules!C$63),IF(OFFSET(P,0,formules!C$63)=MIN(P),WP+OFFSET(Q,0,formules!C$63),WP*(1-(OFFSET(P,0,formules!C$63)-sm)/sm)+OFFSET(Q,0,formules!C$63))),WP*(1-((OFFSET(P,0,formules!C$63)-MIN(P))/MIN(P)))+OFFSET(Q,0,formules!C$63)),\"\")","v":""},{"$f":"IFERROR(IF((sm-MIN(P))/MIN(P)*100>20,IF(OFFSET(P,0,formules!D$63)=sm,0.8*WP+OFFSET(Q,0,formules!D$63),IF(OFFSET(P,0,formules!D$63)=MIN(P),WP+OFFSET(Q,0,formules!D$63),WP*(1-(OFFSET(P,0,formules!D$63)-sm)/sm)+OFFSET(Q,0,formules!D$63))),WP*(1-((OFFSET(P,0,formules!D$63)-MIN(P))/MIN(P)))+OFFSET(Q,0,formules!D$63)),\"\")","v":""},{"$f":"IFERROR(IF((sm-MIN(P))/MIN(P)*100>20,IF(OFFSET(P,0,formules!E$63)=sm,0.8*WP+OFFSET(Q,0,formules!E$63),IF(OFFSET(P,0,formules!E$63)=MIN(P),WP+OFFSET(Q,0,formules!E$63),WP*(1-(OFFSET(P,0,formules!E$63)-sm)/sm)+OFFSET(Q,0,formules!E$63))),WP*(1-((OFFSET(P,0,formules!E$63)-MIN(P))/MIN(P)))+OFFSET(Q,0,formules!E$63)),\"\")","v":""},{"$f":"IFERROR(IF((sm-MIN(P))/MIN(P)*100>20,IF(OFFSET(P,0,formules!F$63)=sm,0.8*WP+OFFSET(Q,0,formules!F$63),IF(OFFSET(P,0,formules!F$63)=MIN(P),WP+OFFSET(Q,0,formules!F$63),WP*(1-(OFFSET(P,0,formules!F$63)-sm)/sm)+OFFSET(Q,0,formules!F$63))),WP*(1-((OFFSET(P,0,formules!F$63)-MIN(P))/MIN(P)))+OFFSET(Q,0,formules!F$63)),\"\")","v":""},{"$f":"IFERROR(IF((sm-MIN(P))/MIN(P)*100>20,IF(OFFSET(P,0,formules!G$63)=sm,0.8*WP+OFFSET(Q,0,formules!G$63),IF(OFFSET(P,0,formules!G$63)=MIN(P),WP+OFFSET(Q,0,formules!G$63),WP*(1-(OFFSET(P,0,formules!G$63)-sm)/sm)+OFFSET(Q,0,formules!G$63))),WP*(1-((OFFSET(P,0,formules!G$63)-MIN(P))/MIN(P)))+OFFSET(Q,0,formules!G$63)),\"\")","v":""},{"$f":"IFERROR(IF((sm-MIN(P))/MIN(P)*100>20,IF(OFFSET(P,0,formules!H$63)=sm,0.8*WP+OFFSET(Q,0,formules!H$63),IF(OFFSET(P,0,formules!H$63)=MIN(P),WP+OFFSET(Q,0,formules!H$63),WP*(1-(OFFSET(P,0,formules!H$63)-sm)/sm)+OFFSET(Q,0,formules!H$63))),WP*(1-((OFFSET(P,0,formules!H$63)-MIN(P))/MIN(P)))+OFFSET(Q,0,formules!H$63)),\"\")","v":""},{"$f":"IFERROR(IF((sm-MIN(P))/MIN(P)*100>20,IF(OFFSET(P,0,formules!I$63)=sm,0.8*WP+OFFSET(Q,0,formules!I$63),IF(OFFSET(P,0,formules!I$63)=MIN(P),WP+OFFSET(Q,0,formules!I$63),WP*(1-(OFFSET(P,0,formules!I$63)-sm)/sm)+OFFSET(Q,0,formules!I$63))),WP*(1-((OFFSET(P,0,formules!I$63)-MIN(P))/MIN(P)))+OFFSET(Q,0,formules!I$63)),\"\")","v":""},{"$f":"IFERROR(IF((sm-MIN(P))/MIN(P)*100>20,IF(OFFSET(P,0,formules!J$63)=sm,0.8*WP+OFFSET(Q,0,formules!J$63),IF(OFFSET(P,0,formules!J$63)=MIN(P),WP+OFFSET(Q,0,formules!J$63),WP*(1-(OFFSET(P,0,formules!J$63)-sm)/sm)+OFFSET(Q,0,formules!J$63))),WP*(1-((OFFSET(P,0,formules!J$63)-MIN(P))/MIN(P)))+OFFSET(Q,0,formules!J$63)),\"\")","v":""},{"$f":"IFERROR(IF((sm-MIN(P))/MIN(P)*100>20,IF(OFFSET(P,0,formules!K$63)=sm,0.8*WP+OFFSET(Q,0,formules!K$63),IF(OFFSET(P,0,formules!K$63)=MIN(P),WP+OFFSET(Q,0,formules!K$63),WP*(1-(OFFSET(P,0,formules!K$63)-sm)/sm)+OFFSET(Q,0,formules!K$63))),WP*(1-((OFFSET(P,0,formules!K$63)-MIN(P))/MIN(P)))+OFFSET(Q,0,formules!K$63)),\"\")","v":""},null,{"$f":"\"Pmažiausia=\"&MIN(P)&\"€; P2mažiausia=\"&sm&\"€;  Wkokybė=\"&WQ&\"; Wkaina=\"&WP","v":"Pmažiausia=0€; P2mažiausia=0€;  Wkokybė=35; Wkaina=65"},null,null,null,1,7,1,2.8E-3,3.5000000000000001E-3,7.4999999999999997E-3,0.1028,1.23E-2,2.8E-3,null,null,null,null,null,null,null,null,0.10730000000000001,0.1016,1.43E-2,13]
["2.15.Chen 2",null,15,null,null,{"$f":"IFERROR((1-(0.5*(OFFSET(P,0,formules!B$63)/MIN(P))))*WP+OFFSET(Q,0,formules!B$63),\"\")","v":""},{"$f":"IFERROR((1-(0.5*(OFFSET(P,0,formules!C$63)/MIN(P))))*WP+OFFSET(Q,0,formules!C$63),\"\")","v":""},{"$f":"IFERROR((1-(0.5*(OFFSET(P,0,formules!D$63)/MIN(P))))*WP+OFFSET(Q,0,formules!D$63),\"\")","v":""},{"$f":"IFERROR((1-(0.5*(OFFSET(P,0,formules!E$63)/MIN(P))))*WP+OFFSET(Q,0,formules!E$63),\"\")","v":""},{"$f":"IFERROR((1-(0.5*(OFFSET(P,0,formules!F$63)/MIN(P))))*WP+OFFSET(Q,0,formules!F$63),\"\")","v":""},{"$f":"IFERROR((1-(0.5*(OFFSET(P,0,formules!G$63)/MIN(P))))*WP+OFFSET(Q,0,formules!G$63),\"\")","v":""},{"$f":"IFERROR((1-(0.5*(OFFSET(P,0,formules!H$63)/MIN(P))))*WP+OFFSET(Q,0,formules!H$63),\"\")","v":""},{"$f":"IFERROR((1-(0.5*(OFFSET(P,0,formules!I$63)/MIN(P))))*WP+OFFSET(Q,0,formules!I$63),\"\")","v":""},{"$f":"IFERROR((1-(0.5*(OFFSET(P,0,formules!J$63)/MIN(P))))*WP+OFFSET(Q,0,formules!J$63),\"\")","v":""},{"$f":"IFERROR((1-(0.5*(OFFSET(P,0,formules!K$63)/MIN(P))))*WP+OFFSET(Q,0,formules!K$63),\"\")","v":""},null,{"$f":"\"Pmažiausia=\"&MIN(P)&\"€; Wkokybė=\"&WQ&\"; Wkaina=\"&WP","v":"Pmažiausia=0€; Wkokybė=35; Wkaina=65"},null,null,null,1,2,1,8.3000000000000001E-3,7.1000000000000004E-3,1.14E-2,3.5000000000000001E-3,8.0000000000000004E-4,0,null,null,null,null,null,null,null,null,5.1999999999999998E-3,1.5900000000000001E-2,0,15]
["2.16.Chen 3",null,16,null,null,{"$f":"IFERROR(WP*(1-0.5*LOG(OFFSET(P,0,formules!B$63)/MIN(P))/LOG(2))+OFFSET(Q,0,formules!B$63),\"\")","v":""},{"$f":"IFERROR(WP*(1-0.5*LOG(OFFSET(P,0,formules!C$63)/MIN(P))/LOG(2))+OFFSET(Q,0,formules!C$63),\"\")","v":""},{"$f":"IFERROR(WP*(1-0.5*LOG(OFFSET(P,0,formules!D$63)/MIN(P))/LOG(2))+OFFSET(Q,0,formules!D$63),\"\")","v":""},{"$f":"IFERROR(WP*(1-0.5*LOG(OFFSET(P,0,formules!E$63)/MIN(P))/LOG(2))+OFFSET(Q,0,formules!E$63),\"\")","v":""},{"$f":"IFERROR(WP*(1-0.5*LOG(OFFSET(P,0,formules!F$63)/MIN(P))/LOG(2))+OFFSET(Q,0,formules!F$63),\"\")","v":""},{"$f":"IFERROR(WP*(1-0.5*LOG(OFFSET(P,0,formules!G$63)/MIN(P))/LOG(2))+OFFSET(Q,0,formules!G$63),\"\")","v":""},{"$f":"IFERROR(WP*(1-0.5*LOG(OFFSET(P,0,formules!H$63)/MIN(P))/LOG(2))+OFFSET(Q,0,formules!H$63),\"\")","v":""},{"$f":"IFERROR(WP*(1-0.5*LOG(OFFSET(P,0,formules!I$63)/MIN(P))/LOG(2))+OFFSET(Q,0,formules!I$63),\"\")","v":""},{"$f":"IFERROR(WP*(1-0.5*LOG(OFFSET(P,0,formules!J$63)/MIN(P))/LOG(2))+OFFSET(Q,0,formules!J$63),\"\")","v":""},{"$f":"IFERROR(WP*(1-0.5*LOG(OFFSET(P,0,formules!K$63)/MIN(P))/LOG(2))+OFFSET(Q,0,formules!K$63),\"\")","v":""},null,{"$f":"\"Pmažiausia=\"&MIN(P)&\"€; Wkokybė=\"&WQ&\"; Wkaina=\"&WP&\"; Log(2)≈\"&ROUND(LOG(2),3)","v":"Pmažiausia=0€; Wkokybė=35; Wkaina=65; Log(2)≈0,301"},"Log(Pi/Pmažiausia)",null,null,1,1,1,0,0,0,0,0,0,null,null,null,null,null,null,null,null,7.9000000000000008E-3,0,0,16]
["2.17. Pauw ir Wolvaardt",null,19,null,"pataisyta, reikia indiferencija perziuret",{"$f":"IFERROR(OFFSET(Q,0,formules!B$63)+WP*((MAX(P)-OFFSET(P,0,formules!B$63))/(MAX(P)-AVERAGE(P))),\"\")","v":""},{"$f":"IFERROR(OFFSET(Q,0,formules!C$63)+WP*((MAX(P)-OFFSET(P,0,formules!C$63))/(MAX(P)-AVERAGE(P))),\"\")","v":""},{"$f":"IFERROR(OFFSET(Q,0,formules!D$63)+WP*((MAX(P)-OFFSET(P,0,formules!D$63))/(MAX(P)-AVERAGE(P))),\"\")","v":""},{"$f":"IFERROR(OFFSET(Q,0,formules!E$63)+WP*((MAX(P)-OFFSET(P,0,formules!E$63))/(MAX(P)-AVERAGE(P))),\"\")","v":""},{"$f":"IFERROR(OFFSET(Q,0,formules!F$63)+WP*((MAX(P)-OFFSET(P,0,formules!F$63))/(MAX(P)-AVERAGE(P))),\"\")","v":""},{"$f":"IFERROR(OFFSET(Q,0,formules!G$63)+WP*((MAX(P)-OFFSET(P,0,formules!G$63))/(MAX(P)-AVERAGE(P))),\"\")","v":""},{"$f":"IFERROR(OFFSET(Q,0,formules!H$63)+WP*((MAX(P)-OFFSET(P,0,formules!H$63))/(MAX(P)-AVERAGE(P))),\"\")","v":""},{"$f":"IFERROR(OFFSET(Q,0,formules!I$63)+WP*((MAX(P)-OFFSET(P,0,formules!I$63))/(MAX(P)-AVERAGE(P))),\"\")","v":""},{"$f":"IFERROR(OFFSET(Q,0,formules!J$63)+WP*((MAX(P)-OFFSET(P,0,formules!J$63))/(MAX(P)-AVERAGE(P))),\"\")","v":""},{"$f":"IFERROR(OFFSET(Q,0,formules!K$63)+WP*((MAX(P)-OFFSET(P,0,formules!K$63))/(MAX(P)-AVERAGE(P))),\"\")","v":""},null,{"$f":"\"Pvidutinė=\"&AVERAGE(P)&\"€; Pdidžiausia=\"&MAX(P)&\"€; Wkokybė=\"&WQ&\"; Wkaina=\"&WP","v":{"$error":"#DIV/0!"}},null,null,null,1,5,2,4.3999999999999997E-2,3.61E-2,2.29E-2,0,6.6E-3,0,null,null,null,null,null,null,null,null,2.3599999999999999E-2,2.5899999999999999E-2,2.0899999999999998E-2,19]
["2.18. Vidutinės kainos",null,20,null,"pataisyta, reikia indiferencija perziuret",{"$f":"IFERROR(OFFSET(Q,0,formules!B$63)+WP*(1-((OFFSET(P,0,formules!B$63)-MIN(P))/AVERAGE(P))),\"\")","v":""},{"$f":"IFERROR(OFFSET(Q,0,formules!C$63)+WP*(1-((OFFSET(P,0,formules!C$63)-MIN(P))/AVERAGE(P))),\"\")","v":""},{"$f":"IFERROR(OFFSET(Q,0,formules!D$63)+WP*(1-((OFFSET(P,0,formules!D$63)-MIN(P))/AVERAGE(P))),\"\")","v":""},{"$f":"IFERROR(OFFSET(Q,0,formules!E$63)+WP*(1-((OFFSET(P,0,formules!E$63)-MIN(P))/AVERAGE(P))),\"\")","v":""},{"$f":"IFERROR(OFFSET(Q,0,formules!F$63)+WP*(1-((OFFSET(P,0,formules!F$63)-MIN(P))/AVERAGE(P))),\"\")","v":""},{"$f":"IFERROR(OFFSET(Q,0,formules!G$63)+WP*(1-((OFFSET(P,0,formules!G$63)-MIN(P))/AVERAGE(P))),\"\")","v":""},{"$f":"IFERROR(OFFSET(Q,0,formules!H$63)+WP*(1-((OFFSET(P,0,formules!H$63)-MIN(P))/AVERAGE(P))),\"\")","v":""},{"$f":"IFERROR(OFFSET(Q,0,formules!I$63)+WP*(1-((OFFSET(P,0,formules!I$63)-MIN(P))/AVERAGE(P))),\"\")","v":""},{"$f":"IFERROR(OFFSET(Q,0,formules!J$63)+WP*(1-((OFFSET(P,0,formules!J$63)-MIN(P))/AVERAGE(P))),\"\")","v":""},{"$f":"IFERROR(OFFSET(Q,0,formules!K$63)+WP*(1-((OFFSET(P,0,formules!K$63)-MIN(P))/AVERAGE(P))),\"\")","v":""},null,{"$f":"\"Pvidutinė=\"&AVERAGE(P)&\"€; Pdidžiausia=\"&MAX(P)&\"€; Wkokybė=\"&WQ&\"; Wkaina=\"&WP","v":{"$error":"#DIV/0!"}},null,null,null,1,2,1,0,0,0,0,5.7000000000000002E-3,0,null,null,null,null,null,null,null,null,1.5699999999999999E-2,1.2699999999999999E-2,4.5999999999999999E-3,20]
["2.19. Mažiausios kainos",null,21,null,null,{"$f":"IFERROR(OFFSET(Q,0,formules!B$63)+WP*((2*MIN(P)-OFFSET(P,0,formules!B$63))/MIN(P)),\"\")","v":""},{"$f":"IFERROR(OFFSET(Q,0,formules!C$63)+WP*((2*MIN(P)-OFFSET(P,0,formules!C$63))/MIN(P)),\"\")","v":""},{"$f":"IFERROR(OFFSET(Q,0,formules!D$63)+WP*((2*MIN(P)-OFFSET(P,0,formules!D$63))/MIN(P)),\"\")","v":""},{"$f":"IFERROR(OFFSET(Q,0,formules!E$63)+WP*((2*MIN(P)-OFFSET(P,0,formules!E$63))/MIN(P)),\"\")","v":""},{"$f":"IFERROR(OFFSET(Q,0,formules!F$63)+WP*((2*MIN(P)-OFFSET(P,0,formules!F$63))/MIN(P)),\"\")","v":""},{"$f":"IFERROR(OFFSET(Q,0,formules!G$63)+WP*((2*MIN(P)-OFFSET(P,0,formules!G$63))/MIN(P)),\"\")","v":""},{"$f":"IFERROR(OFFSET(Q,0,formules!H$63)+WP*((2*MIN(P)-OFFSET(P,0,formules!H$63))/MIN(P)),\"\")","v":""},{"$f":"IFERROR(OFFSET(Q,0,formules!I$63)+WP*((2*MIN(P)-OFFSET(P,0,formules!I$63))/MIN(P)),\"\")","v":""},{"$f":"IFERROR(OFFSET(Q,0,formules!J$63)+WP*((2*MIN(P)-OFFSET(P,0,formules!J$63))/MIN(P)),\"\")","v":""},{"$f":"IFERROR(OFFSET(Q,0,formules!K$63)+WP*((2*MIN(P)-OFFSET(P,0,formules!K$63))/MIN(P)),\"\")","v":""},null,{"$f":"\"Pmažiausia=\"&MIN(P)&\"€; Wkokybė=\"&WQ&\"; Wkaina=\"&WP","v":"Pmažiausia=0€; Wkokybė=35; Wkaina=65"},null,null,null,1,2,1,1.11E-2,1.06E-2,1.14E-2,3.5000000000000001E-3,0,0,null,null,null,null,null,null,null,null,5.1999999999999998E-3,1.5900000000000001E-2,0,21]
["2.20. Pasidalijimo metodo",null,22,null,null,{"$f":"IFERROR(OFFSET(Q,0,formules!B$63)+WP*((OFFSET(P,0,formules!B$63)-MAX(P))/(MIN(P)-MAX(P))),\"\")","v":""},{"$f":"IFERROR(OFFSET(Q,0,formules!C$63)+WP*((OFFSET(P,0,formules!C$63)-MAX(P))/(MIN(P)-MAX(P))),\"\")","v":""},{"$f":"IFERROR(OFFSET(Q,0,formules!D$63)+WP*((OFFSET(P,0,formules!D$63)-MAX(P))/(MIN(P)-MAX(P))),\"\")","v":""},{"$f":"IFERROR(OFFSET(Q,0,formules!E$63)+WP*((OFFSET(P,0,formules!E$63)-MAX(P))/(MIN(P)-MAX(P))),\"\")","v":""},{"$f":"IFERROR(OFFSET(Q,0,formules!F$63)+WP*((OFFSET(P,0,formules!F$63)-MAX(P))/(MIN(P)-MAX(P))),\"\")","v":""},{"$f":"IFERROR(OFFSET(Q,0,formules!G$63)+WP*((OFFSET(P,0,formules!G$63)-MAX(P))/(MIN(P)-MAX(P))),\"\")","v":""},{"$f":"IFERROR(OFFSET(Q,0,formules!H$63)+WP*((OFFSET(P,0,formules!H$63)-MAX(P))/(MIN(P)-MAX(P))),\"\")","v":""},{"$f":"IFERROR(OFFSET(Q,0,formules!I$63)+WP*((OFFSET(P,0,formules!I$63)-MAX(P))/(MIN(P)-MAX(P))),\"\")","v":""},{"$f":"IFERROR(OFFSET(Q,0,formules!J$63)+WP*((OFFSET(P,0,formules!J$63)-MAX(P))/(MIN(P)-MAX(P))),\"\")","v":""},{"$f":"IFERROR(OFFSET(Q,0,formules!K$63)+WP*((OFFSET(P,0,formules!K$63)-MAX(P))/(MIN(P)-MAX(P))),\"\")","v":""},null,{"$f":"\"Pdidžiausia=\"&MAX(P)&\"€; Pmažiausia=\"&MIN(P)&\"€; Wkokybė=\"&WQ&\"; Wkaina=\"&WP","v":"Pdidžiausia=0€; Pmažiausia=0€; Wkokybė=35; Wkaina=65"},null,null,null,1,5,2,1.7600000000000001E-2,1.8100000000000002E-2,5.7000000000000002E-3,1.0999999999999999E-2,9.1000000000000004E-3,0,null,null,null,null,null,null,null,null,"-","-","-",22]
["2.21. Balo pagal reitingą",null,23,null,null,{"$f":"IFERROR(WP*(COUNT(P)-RANK(OFFSET(P,0,formules!B$63),P,1))/(COUNT(P)-1)+OFFSET(Q,0,formules!B$63),\"\")","v":""},{"$f":"IFERROR(WP*(COUNT(P)-RANK(OFFSET(P,0,formules!C$63),P,1))/(COUNT(P)-1)+OFFSET(Q,0,formules!C$63),\"\")","v":""},{"$f":"IFERROR(WP*(COUNT(P)-RANK(OFFSET(P,0,formules!D$63),P,1))/(COUNT(P)-1)+OFFSET(Q,0,formules!D$63),\"\")","v":""},{"$f":"IFERROR(WP*(COUNT(P)-RANK(OFFSET(P,0,formules!E$63),P,1))/(COUNT(P)-1)+OFFSET(Q,0,formules!E$63),\"\")","v":""},{"$f":"IFERROR(WP*(COUNT(P)-RANK(OFFSET(P,0,formules!F$63),P,1))/(COUNT(P)-1)+OFFSET(Q,0,formules!F$63),\"\")","v":""},{"$f":"IFERROR(WP*(COUNT(P)-RANK(OFFSET(P,0,formules!G$63),P,1))/(COUNT(P)-1)+OFFSET(Q,0,formules!G$63),\"\")","v":""},{"$f":"IFERROR(WP*(COUNT(P)-RANK(OFFSET(P,0,formules!H$63),P,1))/(COUNT(P)-1)+OFFSET(Q,0,formules!H$63),\"\")","v":""},{"$f":"IFERROR(WP*(COUNT(P)-RANK(OFFSET(P,0,formules!I$63),P,1))/(COUNT(P)-1)+OFFSET(Q,0,formules!I$63),\"\")","v":""},{"$f":"IFERROR(WP*(COUNT(P)-RANK(OFFSET(P,0,formules!J$63),P,1))/(COUNT(P)-1)+OFFSET(Q,0,formules!J$63),\"\")","v":""},{"$f":"IFERROR(WP*(COUNT(P)-RANK(OFFSET(P,0,formules!K$63),P,1))/(COUNT(P)-1)+OFFSET(Q,0,formules!K$63),\"\")","v":""},null,{"$f":"\" Wkokybė=\"&WQ&\"; Wkaina=\"&WP","v":" Wkokybė=35; Wkaina=65"},"ĮVERTkaina",null,null,1,5,2,8.8900000000000007E-2,8.5099999999999995E-2,5.1400000000000001E-2,1.0999999999999999E-2,3.3E-3,0,null,null,null,null,null,null,null,null,0.13869999999999999,3.1899999999999998E-2,2.4799999999999999E-2,23]
["2.22. Domb Tsur",null,31,"pakeičiau į qx",null,{"$f":"IFERROR((MIN(Qx)+(OFFSET(Qx,0,formules!B$63)-MIN(Qx))*(WQ/WP))/OFFSET(P,0,formules!B$63),\"\")","v":""},{"$f":"IFERROR((MIN(Qx)+(OFFSET(Qx,0,formules!C$63)-MIN(Qx))*(WQ/WP))/OFFSET(P,0,formules!C$63),\"\")","v":""},{"$f":"IFERROR((MIN(Qx)+(OFFSET(Qx,0,formules!D$63)-MIN(Qx))*(WQ/WP))/OFFSET(P,0,formules!D$63),\"\")","v":""},{"$f":"IFERROR((MIN(Qx)+(OFFSET(Qx,0,formules!E$63)-MIN(Qx))*(WQ/WP))/OFFSET(P,0,formules!E$63),\"\")","v":""},{"$f":"IFERROR((MIN(Qx)+(OFFSET(Qx,0,formules!F$63)-MIN(Qx))*(WQ/WP))/OFFSET(P,0,formules!F$63),\"\")","v":""},{"$f":"IFERROR((MIN(Qx)+(OFFSET(Qx,0,formules!G$63)-MIN(Qx))*(WQ/WP))/OFFSET(P,0,formules!G$63),\"\")","v":""},{"$f":"IFERROR((MIN(Qx)+(OFFSET(Qx,0,formules!H$63)-MIN(Qx))*(WQ/WP))/OFFSET(P,0,formules!H$63),\"\")","v":""},{"$f":"IFERROR((MIN(Qx)+(OFFSET(Qx,0,formules!I$63)-MIN(Qx))*(WQ/WP))/OFFSET(P,0,formules!I$63),\"\")","v":""},{"$f":"IFERROR((MIN(Qx)+(OFFSET(Qx,0,formules!J$63)-MIN(Qx))*(WQ/WP))/OFFSET(P,0,formules!J$63),\"\")","v":""},{"$f":"IFERROR((MIN(Qx)+(OFFSET(Qx,0,formules!K$63)-MIN(Qx))*(WQ/WP))/OFFSET(P,0,formules!K$63),\"\")","v":""},null,{"$f":"\"Qmažiausia=\"&MIN(Qx)*100&\"% (arba \" &MIN(Qx)&\"); Wkokybė=\"&WQ&\"; Wkaina=\"&WP","v":"Qmažiausia=0% (arba 0); Wkokybė=35; Wkaina=65"},null,"z",null,1,2,null,"netirta","netirta","netirta","netirta","netirta","netirta",null,null,null,null,null,null,null,null,1.5699999999999999E-2,3.2000000000000002E-3,1.2999999999999999E-3,"n9"]
["2.23. UfAB II formulė BMI",null,32,null,null,{"$f":"IFERROR(((MAX(Qx)*MIN(P))/OFFSET(P,0,formules!B$63))*WP+OFFSET(Q,0,formules!B$63),\"\")","v":""},{"$f":"IFERROR(((MAX(Qx)*MIN(P))/OFFSET(P,0,formules!C$63))*WP+OFFSET(Q,0,formules!C$63),\"\")","v":""},{"$f":"IFERROR(((MAX(Qx)*MIN(P))/OFFSET(P,0,formules!D$63))*WP+OFFSET(Q,0,formules!D$63),\"\")","v":""},{"$f":"IFERROR(((MAX(Qx)*MIN(P))/OFFSET(P,0,formules!E$63))*WP+OFFSET(Q,0,formules!E$63),\"\")","v":""},{"$f":"IFERROR(((MAX(Qx)*MIN(P))/OFFSET(P,0,formules!F$63))*WP+OFFSET(Q,0,formules!F$63),\"\")","v":""},{"$f":"IFERROR(((MAX(Qx)*MIN(P))/OFFSET(P,0,formules!G$63))*WP+OFFSET(Q,0,formules!G$63),\"\")","v":""},{"$f":"IFERROR(((MAX(Qx)*MIN(P))/OFFSET(P,0,formules!H$63))*WP+OFFSET(Q,0,formules!H$63),\"\")","v":""},{"$f":"IFERROR(((MAX(Qx)*MIN(P))/OFFSET(P,0,formules!I$63))*WP+OFFSET(Q,0,formules!I$63),\"\")","v":""},{"$f":"IFERROR(((MAX(Qx)*MIN(P))/OFFSET(P,0,formules!J$63))*WP+OFFSET(Q,0,formules!J$63),\"\")","v":""},{"$f":"IFERROR(((MAX(Qx)*MIN(P))/OFFSET(P,0,formules!K$63))*WP+OFFSET(Q,0,formules!K$63),\"\")","v":""},null,{"$f":"\"Pvidurkis=\"&ROUND(AVERAGE(P),2)&\"€; Pmažiausia=\"&ROUND(MIN(P),2)&\"€; Qdidžiausia=\"&MAX(Qx)*100&\"% (arba \" &MAX(Qx)&\"); Wkokybė=\"&WQ&\"; Wkaina=\"&WP","v":{"$error":"#DIV/0!"}},null,null,null,1,1,null,"netirta","netirta","netirta","netirta","netirta","netirta",null,null,null,null,null,null,null,null,0.15970000000000001,4.4400000000000002E-2,0,"n17"]
["2.24. UfAB medianos metodo BMI",null,33,null,null,{"$f":"IFERROR((OFFSET(Q,0,formules!B$63)/MEDIAN(Q)*WQ)-(OFFSET(P,0,formules!B$63)/MEDIAN(P)*WP),\"\")","v":""},{"$f":"IFERROR((OFFSET(Q,0,formules!C$63)/MEDIAN(Q)*WQ)-(OFFSET(P,0,formules!C$63)/MEDIAN(P)*WP),\"\")","v":""},{"$f":"IFERROR((OFFSET(Q,0,formules!D$63)/MEDIAN(Q)*WQ)-(OFFSET(P,0,formules!D$63)/MEDIAN(P)*WP),\"\")","v":""},{"$f":"IFERROR((OFFSET(Q,0,formules!E$63)/MEDIAN(Q)*WQ)-(OFFSET(P,0,formules!E$63)/MEDIAN(P)*WP),\"\")","v":""},{"$f":"IFERROR((OFFSET(Q,0,formules!F$63)/MEDIAN(Q)*WQ)-(OFFSET(P,0,formules!F$63)/MEDIAN(P)*WP),\"\")","v":""},{"$f":"IFERROR((OFFSET(Q,0,formules!G$63)/MEDIAN(Q)*WQ)-(OFFSET(P,0,formules!G$63)/MEDIAN(P)*WP),\"\")","v":""},{"$f":"IFERROR((OFFSET(Q,0,formules!H$63)/MEDIAN(Q)*WQ)-(OFFSET(P,0,formules!H$63)/MEDIAN(P)*WP),\"\")","v":""},{"$f":"IFERROR((OFFSET(Q,0,formules!I$63)/MEDIAN(Q)*WQ)-(OFFSET(P,0,formules!I$63)/MEDIAN(P)*WP),\"\")","v":""},{"$f":"IFERROR((OFFSET(Q,0,formules!J$63)/MEDIAN(Q)*WQ)-(OFFSET(P,0,formules!J$63)/MEDIAN(P)*WP),\"\")","v":""},{"$f":"IFERROR((OFFSET(Q,0,formules!K$63)/MEDIAN(Q)*WQ)-(OFFSET(P,0,formules!K$63)/MEDIAN(P)*WP),\"\")","v":""},null,{"$f":"\"Pmediana=\"&ROUND(MEDIAN(P),2)&\"€; Qmediana=\"&MEDIAN(Qx)*100&\"% (arba \" &MEDIAN(Qx)&\"); Wkokybė=\"&WQ&\"; Wkaina=\"&WP","v":{"$error":"#NUM!"}},null,"z",null,1,2,null,"netirta","netirta","netirta","netirta","netirta","netirta",null,null,null,null,null,null,null,null,2.8799999999999999E-2,2.24E-2,4.5999999999999999E-3,"n18"]
["2.25. Kiekybinio pasiskirstymo 1",null,34,null,null,{"$f":"IFERROR(((AVERAGE(P)-OFFSET(P,0,formules!B$63)+MIN(P))/AVERAGE(P))*WP+(OFFSET(Q,0,formules!B$63)/MAX(Q)*WQ),\"\")","v":""},{"$f":"IFERROR(((AVERAGE(P)-OFFSET(P,0,formules!C$63)+MIN(P))/AVERAGE(P))*WP+(OFFSET(Q,0,formules!C$63)/MAX(Q)*WQ),\"\")","v":""},{"$f":"IFERROR(((AVERAGE(P)-OFFSET(P,0,formules!D$63)+MIN(P))/AVERAGE(P))*WP+(OFFSET(Q,0,formules!D$63)/MAX(Q)*WQ),\"\")","v":""},{"$f":"IFERROR(((AVERAGE(P)-OFFSET(P,0,formules!E$63)+MIN(P))/AVERAGE(P))*WP+(OFFSET(Q,0,formules!E$63)/MAX(Q)*WQ),\"\")","v":""},{"$f":"IFERROR(((AVERAGE(P)-OFFSET(P,0,formules!F$63)+MIN(P))/AVERAGE(P))*WP+(OFFSET(Q,0,formules!F$63)/MAX(Q)*WQ),\"\")","v":""},{"$f":"IFERROR(((AVERAGE(P)-OFFSET(P,0,formules!G$63)+MIN(P))/AVERAGE(P))*WP+(OFFSET(Q,0,formules!G$63)/MAX(Q)*WQ),\"\")","v":""},{"$f":"IFERROR(((AVERAGE(P)-OFFSET(P,0,formules!H$63)+MIN(P))/AVERAGE(P))*WP+(OFFSET(Q,0,formules!H$63)/MAX(Q)*WQ),\"\")","v":""},{"$f":"IFERROR(((AVERAGE(P)-OFFSET(P,0,formules!I$63)+MIN(P))/AVERAGE(P))*WP+(OFFSET(Q,0,formules!I$63)/MAX(Q)*WQ),\"\")","v":""},{"$f":"IFERROR(((AVERAGE(P)-OFFSET(P,0,formules!J$63)+MIN(P))/AVERAGE(P))*WP+(OFFSET(Q,0,formules!J$63)/MAX(Q)*WQ),\"\")","v":""},{"$f":"IFERROR(((AVERAGE(P)-OFFSET(P,0,formules!K$63)+MIN(P))/AVERAGE(P))*WP+(OFFSET(Q,0,formules!K$63)/MAX(Q)*WQ),\"\")","v":""},null,{"$f":"\"Pvidurkis=\"&ROUND(AVERAGE(P),2)&\"€; Pmažiausia=\"&ROUND(MIN(P),2)&\"€; Qdidžiausia=\"&MAX(Qx)*100&\"% (arba \" &MAX(Qx)&\"); Wkokybė=\"&WQ&\"; Wkaina=\"&WP","v":{"$error":"#DIV/0!"}},null,"z",null,1,2,null,"netirta","netirta","netirta","netirta","netirta","netirta",null,null,null,null,null,null,null,null,2.6200000000000001E-2,1.9199999999999998E-2,0,"n22"]
["2.26. Kiekybinio pasiskirstymo 2",null,35,null,null,{"$f":"IFERROR(((2*MIN(P)-OFFSET(P,0,formules!B$63))/MIN(P))*WP+(OFFSET(Q,0,formules!B$63)/MAX(Q)*WQ),\"\")","v":""},{"$f":"IFERROR(((2*MIN(P)-OFFSET(P,0,formules!C$63))/MIN(P))*WP+(OFFSET(Q,0,formules!C$63)/MAX(Q)*WQ),\"\")","v":""},{"$f":"IFERROR(((2*MIN(P)-OFFSET(P,0,formules!D$63))/MIN(P))*WP+(OFFSET(Q,0,formules!D$63)/MAX(Q)*WQ),\"\")","v":""},{"$f":"IFERROR(((2*MIN(P)-OFFSET(P,0,formules!E$63))/MIN(P))*WP+(OFFSET(Q,0,formules!E$63)/MAX(Q)*WQ),\"\")","v":""},{"$f":"IFERROR(((2*MIN(P)-OFFSET(P,0,formules!F$63))/MIN(P))*WP+(OFFSET(Q,0,formules!F$63)/MAX(Q)*WQ),\"\")","v":""},{"$f":"IFERROR(((2*MIN(P)-OFFSET(P,0,formules!G$63))/MIN(P))*WP+(OFFSET(Q,0,formules!G$63)/MAX(Q)*WQ),\"\")","v":""},{"$f":"IFERROR(((2*MIN(P)-OFFSET(P,0,formules!H$63))/MIN(P))*WP+(OFFSET(Q,0,formules!H$63)/MAX(Q)*WQ),\"\")","v":""},{"$f":"IFERROR(((2*MIN(P)-OFFSET(P,0,formules!I$63))/MIN(P))*WP+(OFFSET(Q,0,formules!I$63)/MAX(Q)*WQ),\"\")","v":""},{"$f":"IFERROR(((2*MIN(P)-OFFSET(P,0,formules!J$63))/MIN(P))*WP+(OFFSET(Q,0,formules!J$63)/MAX(Q)*WQ),\"\")","v":""},{"$f":"IFERROR(((2*MIN(P)-OFFSET(P,0,formules!K$63))/MIN(P))*WP+(OFFSET(Q,0,formules!K$63)/MAX(Q)*WQ),\"\")","v":""},null,{"$f":"\"Pdidžiausia=\"&ROUND(MAX(P),2)&\"€ Pmažiausia=\"&ROUND(MIN(P),2)&\"€; Qdidžiausia=\"&MAX(Qx)*100&\"% (arba \" &MAX(Qx)&\"); Wkokybė=\"&WQ&\"; Wkaina=\"&WP","v":"Pdidžiausia=0€ Pmažiausia=0€; Qdidžiausia=0% (arba 0); Wkokybė=35; Wkaina=65"},null,"z",null,1,2,null,"netirta","netirta","netirta","netirta","netirta","netirta",null,null,null,null,null,null,null,null,1.5699999999999999E-2,4.1500000000000002E-2,0,"n23"]
["2.27. Kiekybinio pasiskirstymo 3",null,36,null,null,{"$f":"IFERROR(((MAX(P)-OFFSET(P,0,formules!B$63))/(MAX(P)-MIN(P)))*WP+(OFFSET(Q,0,formules!B$63)/MAX(Q)*WQ),\"\")","v":""},{"$f":"IFERROR(((MAX(P)-OFFSET(P,0,formules!C$63))/(MAX(P)-MIN(P)))*WP+(OFFSET(Q,0,formules!C$63)/MAX(Q)*WQ),\"\")","v":""},{"$f":"IFERROR(((MAX(P)-OFFSET(P,0,formules!D$63))/(MAX(P)-MIN(P)))*WP+(OFFSET(Q,0,formules!D$63)/MAX(Q)*WQ),\"\")","v":""},{"$f":"IFERROR(((MAX(P)-OFFSET(P,0,formules!E$63))/(MAX(P)-MIN(P)))*WP+(OFFSET(Q,0,formules!E$63)/MAX(Q)*WQ),\"\")","v":""},{"$f":"IFERROR(((MAX(P)-OFFSET(P,0,formules!F$63))/(MAX(P)-MIN(P)))*WP+(OFFSET(Q,0,formules!F$63)/MAX(Q)*WQ),\"\")","v":""},{"$f":"IFERROR(((MAX(P)-OFFSET(P,0,formules!G$63))/(MAX(P)-MIN(P)))*WP+(OFFSET(Q,0,formules!G$63)/MAX(Q)*WQ),\"\")","v":""},{"$f":"IFERROR(((MAX(P)-OFFSET(P,0,formules!H$63))/(MAX(P)-MIN(P)))*WP+(OFFSET(Q,0,formules!H$63)/MAX(Q)*WQ),\"\")","v":""},{"$f":"IFERROR(((MAX(P)-OFFSET(P,0,formules!I$63))/(MAX(P)-MIN(P)))*WP+(OFFSET(Q,0,formules!I$63)/MAX(Q)*WQ),\"\")","v":""},{"$f":"IFERROR(((MAX(P)-OFFSET(P,0,formules!J$63))/(MAX(P)-MIN(P)))*WP+(OFFSET(Q,0,formules!J$63)/MAX(Q)*WQ),\"\")","v":""},{"$f":"IFERROR(((MAX(P)-OFFSET(P,0,formules!K$63))/(MAX(P)-MIN(P)))*WP+(OFFSET(Q,0,formules!K$63)/MAX(Q)*WQ),\"\")","v":""},null,{"$f":"\"Pdidžiausia=\"&ROUND(MAX(P),2)&\"€; Pmažiausia=\"&ROUND(MIN(P),2)&\"€; Qdidžiausia=\"&MAX(Qx)*100&\"% (arba \" &MAX(Qx)&\"); Wkokybė=\"&WQ&\"; Wkaina=\"&WP","v":"Pdidžiausia=0€; Pmažiausia=0€; Qdidžiausia=0% (arba 0); Wkokybė=35; Wkaina=65"},null,"z",null,1,5,null,"netirta","netirta","netirta","netirta","netirta","netirta",null,null,null,null,null,null,null,null,0.1099,6.0900000000000003E-2,0,"n24"]
[]
[]
[]
[]
[null,null,null,"setmin","setmax"]
["Kokybės formulės",null,null,"o"]
["Didžiausias - geriausias",null,1,1]
["Mažiausias - geriausias",null,2,1]
["Taip / Ne",null,3,"Taip - max balų, Ne - 0 balų."]
["Tiesioginis balų suteikimas",null,4,"Rankinis balų įrašymas, kai netinka kitos formulės"]
["MAX - 0 balų, Min - max balų",null,5]
["MAX - max balų, min - 0 balų",null,6]
[]
["Wq",{"$f":"100-duomenys!A11","v":35}]
["Small:",{"$f":"IFERROR(SMALL(P,COUNTIF(P,0)+COUNTIF(P,SMALL(P,COUNTIF(P,0)+1))+1),0)","v":0}]
["Formula ID:",{"$f":"VLOOKUP(duomenys!C11,formules!A2:C47,3,FALSE)","v":18}]
["IndifId",{"$f":"VLOOKUP(B59,formules!C2:AC47,21)","v":1}]
[]
["Rank",{"$f":"IFERROR(RANK(duomenys!F11,P,1),\"\")","v":""},{"$f":"IFERROR(RANK(duomenys!G11,P,1),\"\")","v":""},{"$f":"IFERROR(RANK(duomenys!H11,P,1),\"\")","v":""},{"$f":"IFERROR(RANK(duomenys!I11,P,1),\"\")","v":""},{"$f":"IFERROR(RANK(duomenys!J11,P,1),\"\")","v":""},{"$f":"IFERROR(RANK(duomenys!K11,P,1),\"\")","v":""},{"$f":"IFERROR(RANK(duomenys!L11,P,1),\"\")","v":""},{"$f":"IFERROR(RANK(duomenys!M11,P,1),\"\")","v":""},{"$f":"IFERROR(RANK(duomenys!N11,P,1),\"\")","v":""},{"$f":"IFERROR(RANK(duomenys!O11,P,1),\"\")","v":""}]
["ID:",0,1,2,3,4,5,6,7,8,9]
["ID_result",6,7,8,9,10,11,12,13,14,15]
[]
["Check count",{"$f":"AVERAGE(kainos)","v":{"$error":"#DIV/0!"}}]
["Check average",{"$f":"AVERAGE(duomenys!F35:O35)","v":{"$error":"#DIV/0!"}},{"$f":"IF(OR(ROUND(duomenys!F35,0)<>ROUND(B67,0),B66>1000000000,B66<0),\"fail\",\"success\")","v":{"$error":"#VALUE!"}}]
[]
[]
[]
[]
[{"$f":"VLOOKUP(duomenys!$C$11,formules!$A$2:$AP82,42,FALSE)","v":0}]
[]
[]
[]
[]
[null,null,null,null,"Ui",{"$f":"IFERROR(((1-(MAX(Qx)-OFFSET(Qx,0,formules!B$63))*(WQ/WP))*MIN(P))/OFFSET(P,0,formules!B$63),\"\")","v":""},{"$f":"IFERROR(((1-(MAX(Qx)-OFFSET(Qx,0,formules!C$63))*(WQ/WP))*MIN(P))/OFFSET(P,0,formules!C$63),\"\")","v":""},{"$f":"IFERROR(((1-(MAX(Qx)-OFFSET(Qx,0,formules!D$63))*(WQ/WP))*MIN(P))/OFFSET(P,0,formules!D$63),\"\")","v":""},{"$f":"IFERROR(((1-(MAX(Qx)-OFFSET(Qx,0,formules!E$63))*(WQ/WP))*MIN(P))/OFFSET(P,0,formules!E$63),\"\")","v":""},{"$f":"IFERROR(((1-(MAX(Qx)-OFFSET(Qx,0,formules!F$63))*(WQ/WP))*MIN(P))/OFFSET(P,0,formules!F$63),\"\")","v":""},{"$f":"IFERROR(((1-(MAX(Qx)-OFFSET(Qx,0,formules!G$63))*(WQ/WP))*MIN(P))/OFFSET(P,0,formules!G$63),\"\")","v":""},{"$f":"IFERROR(((1-(MAX(Qx)-OFFSET(Qx,0,formules!H$63))*(WQ/WP))*MIN(P))/OFFSET(P,0,formules!H$63),\"\")","v":""},{"$f":"IFERROR(((1-(MAX(Qx)-OFFSET(Qx,0,formules!I$63))*(WQ/WP))*MIN(P))/OFFSET(P,0,formules!I$63),\"\")","v":""},{"$f":"IFERROR(((1-(MAX(Qx)-OFFSET(Qx,0,formules!J$63))*(WQ/WP))*MIN(P))/OFFSET(P,0,formules!J$63),\"\")","v":""},{"$f":"IFERROR(((1-(MAX(Qx)-OFFSET(Qx,0,formules!K$63))*(WQ/WP))*MIN(P))/OFFSET(P,0,formules!K$63),\"\")","v":""}]
[null,null,null,null,"bbi",{"$f":"F77/MAX(ui)*OFFSET(P,0,formules!B$63)","v":{"$error":"#VALUE!"}},{"$f":"G77/MAX(ui)*OFFSET(P,0,formules!C$63)","v":{"$error":"#VALUE!"}},{"$f":"H77/MAX(ui)*OFFSET(P,0,formules!D$63)","v":{"$error":"#VALUE!"}},{"$f":"I77/MAX(ui)*OFFSET(P,0,formules!E$63)","v":{"$error":"#VALUE!"}},{"$f":"J77/MAX(ui)*OFFSET(P,0,formules!F$63)","v":{"$error":"#VALUE!"}},{"$f":"K77/MAX(ui)*OFFSET(P,0,formules!G$63)","v":{"$error":"#VALUE!"}},{"$f":"L77/MAX(ui)*OFFSET(P,0,formules!H$63)","v":{"$error":"#VALUE!"}},{"$f":"M77/MAX(ui)*OFFSET(P,0,formules!I$63)","v":{"$error":"#VALUE!"}},{"$f":"N77/MAX(ui)*OFFSET(P,0,formules!J$63)","v":{"$error":"#VALUE!"}},{"$f":"O77/MAX(ui)*OFFSET(P,0,formules!K$63)","v":{"$error":"#VALUE!"}}]
[null,null,null,null,"pi1",{"$f":"OFFSET(P,0,formules!B$63)-F78","v":{"$error":"#VALUE!"}},{"$f":"OFFSET(P,0,formules!C$63)-G78","v":{"$error":"#VALUE!"}},{"$f":"OFFSET(P,0,formules!D$63)-H78","v":{"$error":"#VALUE!"}},{"$f":"OFFSET(P,0,formules!E$63)-I78","v":{"$error":"#VALUE!"}},{"$f":"OFFSET(P,0,formules!F$63)-J78","v":{"$error":"#VALUE!"}},{"$f":"OFFSET(P,0,formules!G$63)-K78","v":{"$error":"#VALUE!"}},{"$f":"OFFSET(P,0,formules!H$63)-L78","v":{"$error":"#VALUE!"}},{"$f":"OFFSET(P,0,formules!I$63)-M78","v":{"$error":"#VALUE!"}},{"$f":"OFFSET(P,0,formules!J$63)-N78","v":{"$error":"#VALUE!"}},{"$f":"OFFSET(P,0,formules!K$63)-O78","v":{"$error":"#VALUE!"}}]
[null,null,null,null,"pi2",{"$f":"OFFSET(P,0,formules!B$63)*((MAX(ui)-F77)/MAX(ui))","v":{"$error":"#VALUE!"}},{"$f":"OFFSET(P,0,formules!C$63)*((MAX(ui)-G77)/MAX(ui))","v":{"$error":"#VALUE!"}},{"$f":"OFFSET(P,0,formules!D$63)*((MAX(ui)-H77)/MAX(ui))","v":{"$error":"#VALUE!"}},{"$f":"OFFSET(P,0,formules!E$63)*((MAX(ui)-I77)/MAX(ui))","v":{"$error":"#VALUE!"}},{"$f":"OFFSET(P,0,formules!F$63)*((MAX(ui)-J77)/MAX(ui))","v":{"$error":"#VALUE!"}},{"$f":"OFFSET(P,0,formules!G$63)*((MAX(ui)-K77)/MAX(ui))","v":{"$error":"#VALUE!"}},{"$f":"OFFSET(P,0,formules!H$63)*((MAX(ui)-L77)/MAX(ui))","v":{"$error":"#VALUE!"}},{"$f":"OFFSET(P,0,formules!I$63)*((MAX(ui)-M77)/MAX(ui))","v":{"$error":"#VALUE!"}},{"$f":"OFFSET(P,0,formules!J$63)*((MAX(ui)-N77)/MAX(ui))","v":{"$error":"#VALUE!"}},{"$f":"OFFSET(P,0,formules!K$63)*((MAX(ui)-O77)/MAX(ui))","v":{"$error":"#VALUE!"}}]
[]
[]
[]
[]
[]
[]
[]
[]
[]
[]
[]
[]
[]
[]
[]
[]
[]
[]
[]
[]
[]
["gh",{"$f":"+duomenys!F11","v":0},{"$f":"+duomenys!G11","v":0},{"$f":"+duomenys!H11","v":0},{"$f":"+duomenys!I11","v":0},{"$f":"+duomenys!J11","v":0},{"$f":"+duomenys!K11","v":0},{"$f":"+duomenys!L11","v":0},{"$f":"+duomenys!M11","v":0},{"$f":"+duomenys!N11","v":0},{"$f":"+duomenys!O11","v":0}]
["gh",10,20,30,40,50,60,70,80,90,100]

{"sheet":"Indifference","index":4,"n_rows":53,"n_cols":26,"rows_kept":53,"cut":false,"hidden":true,"merged":[]}
[]
[]
[]
[]
[]
[]
[]
[]
[null,null,null,null,null,null,null,null,null,null,null,null,null,null,null,"Kokybė",{"$f":"ROUND(duomenys!F40,2)","v":{"$error":"#VALUE!"}},{"$f":"ROUND(duomenys!G40,2)","v":{"$error":"#VALUE!"}},{"$f":"ROUND(duomenys!H40,2)","v":{"$error":"#VALUE!"}},{"$f":"ROUND(duomenys!I40,2)","v":{"$error":"#VALUE!"}},{"$f":"ROUND(duomenys!J40,2)","v":{"$error":"#VALUE!"}},{"$f":"ROUND(duomenys!K40,2)","v":{"$error":"#VALUE!"}},{"$f":"ROUND(duomenys!L40,2)","v":{"$error":"#VALUE!"}},{"$f":"ROUND(duomenys!M40,2)","v":{"$error":"#VALUE!"}},{"$f":"ROUND(duomenys!N40,2)","v":{"$error":"#VALUE!"}},{"$f":"ROUND(duomenys!O40,2)","v":{"$error":"#VALUE!"}}]
[null,null,null,null,null,null,null,null,null,null,null,null,null,null,null,"Kaina",{"$f":"ROUND(duomenys!F11,2)","v":0},{"$f":"ROUND(duomenys!G11,2)","v":0},{"$f":"ROUND(duomenys!H11,2)","v":0},{"$f":"ROUND(duomenys!I11,2)","v":0},{"$f":"ROUND(duomenys!J11,2)","v":0},{"$f":"ROUND(duomenys!K11,2)","v":0},{"$f":"ROUND(duomenys!L11,2)","v":0},{"$f":"ROUND(duomenys!M11,2)","v":0},{"$f":"ROUND(duomenys!N11,2)","v":0},{"$f":"ROUND(duomenys!O11,2)","v":0}]
[]
[null,null,null,null,null,null,null,null,null,null,null,null,null,null,null,"Kokybė"]
[null,null,null,null,null,null,null,null,null,null,null,null,null,null,null,"Kaina 20"]
[null,null,null,null,null,null,null,null,null,null,null,null,null,null,null,"Kokybė"]
[null,null,null,null,null,null,null,null,null,null,null,null,null,null,null,"Kaina 40"]
[null,null,null,null,null,null,null,null,null,null,null,null,null,null,null,"Kokybė"]
[null,null,null,null,null,null,null,null,null,null,null,null,null,null,null,"Kaina 50"]
[null,null,null,null,null,null,null,null,null,null,null,null,null,null,null,"Kokybė"]
[null,null,null,null,null,null,null,null,null,null,null,null,null,null,null,"Kaina 60"]
[null,null,null,null,null,null,null,null,null,null,null,null,null,null,null,"Kokybė"]
[null,null,null,null,null,null,null,null,null,null,null,null,null,null,null,"Kaina 80"]
[]
[]
[]
[]
[]
[]
[]
[]
[]
[]
[]
[]
[]
[]
[]
[]
[]
[]
[]
[]
[]
[]
[]
[]
[]
[]
[null,null,null,null,null,null,null,null,null,null,null,null,null,null,null,{"$f":"+Q21+0.15","v":0.15},{"$f":"+R21+0.15","v":0.15},0.15,0.15,0.15,0.15,0.15,0.15,0.15,0.15]
[]
[null,null,null,null,null,null,null,null,null,null,null,null,null,1,1,null,1]
[null,null,null,null,null,null,null,null,null,null,null,null,null,null,2,null,2]
[null,null,null,null,null,null,null,null,null,null,null,null,null,null,{"$f":"+(O50/O51)","v":0.5},null,{"$f":"+(Q50/Q51)","v":0.5}]
[null,null,null,null,null,null,null,null,null,null,null,null,null,null,{"$f":"+POWER(O52,N50)","v":0.5},"+",{"$f":"+POWER(Q52,N50)","v":0.5},"=",{"$f":"+O53+Q53","v":1}]

{"sheet":"iliustracijos","index":5,"n_rows":12,"n_cols":12,"rows_kept":12,"cut":false,"hidden":true,"merged":[]}
[1,null,1,null,1,null,null,null,1,null,null,1]
[2,null,2,null,2,null,null,null,2,null,null,2]
[3,null,3,null,null,{"$f":"duomenys!H7","v":1},null,null,3]
[null,{"$f":"duomenys!F7","v":2},4]
[null,null,5]
[null,null,6]
[null,null,7]
[null,null,8]
[null,null,9]
[null,null,10]
[null,null,11]
[null,null,null,{"$f":"duomenys!G7","v":2}]

{"sheet":"matrix","index":6,"n_rows":129,"n_cols":28,"rows_kept":129,"cut":false,"hidden":true,"merged":[]}
["A1","B1","C1","D1","E1","F1","G1","H1","I1","J1","K1","L1","M1","N1","O1","P1","Q1","R1","S1","T1","U1","V1","W1","X1","Y1","Z1","AA1","AB1"]
["A2","B2","C2","D2","E2","F2","G2","H2","I2","J2","K2","L2","M2","N2","O2","P2","Q2","R2","S2","T2","U2","V2","W2","X2","Y2","Z2","AA2","AB2"]
["A3","B3","C3","D3","E3","F3","G3","H3","I3","J3","K3","L3","M3","N3","O3","P3","Q3","R3","S3","T3","U3","V3","W3","X3","Y3","Z3","AA3","AB3"]
["A4","B4","C4","D4","E4","F4","G4","H4","I4","J4","K4","L4","M4","N4","O4","P4","Q4","R4","S4","T4","U4","V4","W4","X4","Y4","Z4","AA4","AB4"]
["A5","B5","C5","D5","E5","F5","G5","H5","I5","J5","K5","L5","M5","N5","O5","P5","Q1","R5","S5","T5","U5","V5","W5","X5","Y5","Z5","AA5","AB5"]
["A6","B6","C6","D6","E6","F6","G6","H6","I6","J6","K6","L6","M6","N6","O6","P6","Q2","R6","S6","T6","U6","V6","W6","X6","Y6","Z6","AA6","AB6"]
["A7","B7","C7","D7","E7","F7","G7","H7","I7","J7","K7","L7","M7","N7","O7","P7","Q3","R7","S7","T7","U7","V7","W7","X7","Y7","Z7","AA7","AB7"]
["A8","B8","C8","D8","E8","F8","G8","H8","I8","J8","K8","L8","M8","N8","O8","P8","Q4","R8","S8","T8","U8","V8","W8","X8","Y8","Z8","AA8","AB8"]
["A9","B9","C9","D9","E9","F9","G9","H9","I9","J9","K9","L9","M9","N9","O9","P9","Q1","R9","S9","T9","U9","V9","W9","X9","Y9","Z9","AA9","AB9"]
["A10","B10","C10","D10","E10","F10","G10","H10","I10","J10","K10","L10","M10","N10","O10","P10","Q2","R10","S10","T10","U10","V10","W10","X10","Y10","Z10","AA10","AB10"]
["A11","B11","C11","D11","E11","F11","G11","H11","I11","J11","K11","L11","M11","N11","O11","P11","Q3","R11","S11","T11","U11","V11","W11","X11","Y11","Z11","AA11","AB11"]
["A12","B12","C12","D12","E12","F12","G12","H12","I12","J12","K12","L12","M12","N12","O12","P12","Q4","R12","S12","T12","U12","V12","W12","X12","Y12","Z12","AA12","AB12"]
["A13","B13","C13","D13","E13","F13","G13","H13","I13","J13","K13","L13","M13","N13","O13","P13","Q1","R13","S13","T13","U13","V13","W13","X13","Y13","Z13","AA13","AB13"]
["A14","B14","C14","D14","E14","F14","G14","H14","I14","J14","K14","L14","M14","N14","O14","P14","Q2","R14","S14","T14","U14","V14","W14","X14","Y14","Z14","AA14","AB14"]
["A15","B15","C15","D15","E15","F15","G15","H15","I15","J15","K15","L15","M15","N15","O15","P15","Q3","R15","S15","T15","U15","V15","W15","X15","Y15","Z15","AA15","AB15"]
["A16","B16","C16","D16","E16","F16","G16","H16","I16","J16","K16","L16","M16","N16","O16","P16","Q4","R16","S16","T16","U16","V16","W16","X16","Y16","Z16","AA16","AB16"]
["A17","B17","C17","D17","E17","F17","G17","H17","I17","J17","K17","L17","M17","N17","O17","P17","Q1","R17","S17","T17","U17","V17","W17","X17","Y17","Z17","AA17","AB17"]
["A18","B18","C18","D18","E18","F18","G18","H18","I18","J18","K18","L18","M18","N18","O18","P18","Q2","R18","S18","T18","U18","V18","W18","X18","Y18","Z18","AA18","AB18"]
["A19","B19","C19","D19","E19","F19","G19","H19","I19","J19","K19","L19","M19","N19","O19","P19","Q3","R19","S19","T19","U19","V19","W19","X19","Y19","Z19","AA19","AB19"]
["A20","B20","C20","D20","E20","F20","G20","H20","I20","J20","K20","L20","M20","N20","O20","P20","Q4","R20","S20","T20","U20","V20","W20","X20","Y20","Z20","AA20","AB20"]
["A21","B21","C21","D21","E21","F21","G21","H21","I21","J21","K21","L21","M21","N21","O21","P21","Q1","R21","S21","T21","U21","V21","W21","X21","Y21","Z21","AA21","AB21"]
[]
[]
[]
[]
[]
[]
[]
[]
[1]
[2]
[3]
[4]
[5]
[6]
[7]
[8]
[9]
[10]
[11]
[12]
[13]
[14]
[15]
[16]
[17]
[18]
[19]
[20]
[21]
[22]
[23]
[24]
[25]
[26]
[27]
[28]
[29]
[30]
[31]
[32]
[33]
[34]
[35]
[36]
[37]
[38]
[39]
[40]
[41]
[42]
[43]
[44]
[45]
[46]
[47]
[48]
[49]
[50]
[51]
[52]
[53]
[54]
[55]
[56]
[57]
[58]
[59]
[60]
[61]
[62]
[63]
[64]
[65]
[66]
[67]
[68]
[69]
[70]
[71]
[72]
[73]
[74]
[75]
[76]
[77]
[78]
[79]
[80]
[81]
[82]
[83]
[84]
[85]
[86]
[87]
[88]
[89]
[90]
[91]
[92]
[93]
[94]
[95]
[96]
[97]
[98]
[99]
[100]

{"sheet":"1","index":7,"n_rows":16,"n_cols":10,"rows_kept":16,"cut":false,"hidden":true,"merged":[]}
[{"$f":"IF(duomenys!$F12<>\"\",duomenys!$A12*duomenys!F12/MAX(duomenys!$F12:$O12),\"\")","v":""},{"$f":"IF(duomenys!$F12<>\"\",duomenys!$A12*duomenys!G12/MAX(duomenys!$F12:$O12),\"\")","v":""},{"$f":"IF(duomenys!$F12<>\"\",duomenys!$A12*duomenys!H12/MAX(duomenys!$F12:$O12),\"\")","v":""},{"$f":"IF(duomenys!$F12<>\"\",duomenys!$A12*duomenys!I12/MAX(duomenys!$F12:$O12),\"\")","v":""},{"$f":"IF(duomenys!$F12<>\"\",duomenys!$A12*duomenys!J12/MAX(duomenys!$F12:$O12),\"\")","v":""},{"$f":"IF(duomenys!$F12<>\"\",duomenys!$A12*duomenys!K12/MAX(duomenys!$F12:$O12),\"\")","v":""},{"$f":"IF(duomenys!$F12<>\"\",duomenys!$A12*duomenys!L12/MAX(duomenys!$F12:$O12),\"\")","v":""},{"$f":"IF(duomenys!$F12<>\"\",duomenys!$A12*duomenys!M12/MAX(duomenys!$F12:$O12),\"\")","v":""},{"$f":"IF(duomenys!$F12<>\"\",duomenys!$A12*duomenys!N12/MAX(duomenys!$F12:$O12),\"\")","v":""},{"$f":"IF(duomenys!$F12<>\"\",duomenys!$A12*duomenys!O12/MAX(duomenys!$F12:$O12),\"\")","v":""}]
[{"$f":"IF(duomenys!$F14<>\"\",duomenys!$A14*duomenys!F14/MAX(duomenys!$F14:$O14),\"\")","v":""},{"$f":"IF(duomenys!$F14<>\"\",duomenys!$A14*duomenys!G14/MAX(duomenys!$F14:$O14),\"\")","v":""},{"$f":"IF(duomenys!$F14<>\"\",duomenys!$A14*duomenys!H14/MAX(duomenys!$F14:$O14),\"\")","v":""},{"$f":"IF(duomenys!$F14<>\"\",duomenys!$A14*duomenys!I14/MAX(duomenys!$F14:$O14),\"\")","v":""},{"$f":"IF(duomenys!$F14<>\"\",duomenys!$A14*duomenys!J14/MAX(duomenys!$F14:$O14),\"\")","v":""},{"$f":"IF(duomenys!$F14<>\"\",duomenys!$A14*duomenys!K14/MAX(duomenys!$F14:$O14),\"\")","v":""},{"$f":"IF(duomenys!$F14<>\"\",duomenys!$A14*duomenys!L14/MAX(duomenys!$F14:$O14),\"\")","v":""},{"$f":"IF(duomenys!$F14<>\"\",duomenys!$A14*duomenys!M14/MAX(duomenys!$F14:$O14),\"\")","v":""},{"$f":"IF(duomenys!$F14<>\"\",duomenys!$A14*duomenys!N14/MAX(duomenys!$F14:$O14),\"\")","v":""},{"$f":"IF(duomenys!$F14<>\"\",duomenys!$A14*duomenys!O14/MAX(duomenys!$F14:$O14),\"\")","v":""}]
[{"$f":"IF(duomenys!$F16<>\"\",duomenys!$A16*duomenys!F16/MAX(duomenys!$F16:$O16),\"\")","v":""},{"$f":"IF(duomenys!$F16<>\"\",duomenys!$A16*duomenys!G16/MAX(duomenys!$F16:$O16),\"\")","v":""},{"$f":"IF(duomenys!$F16<>\"\",duomenys!$A16*duomenys!H16/MAX(duomenys!$F16:$O16),\"\")","v":""},{"$f":"IF(duomenys!$F16<>\"\",duomenys!$A16*duomenys!I16/MAX(duomenys!$F16:$O16),\"\")","v":""},{"$f":"IF(duomenys!$F16<>\"\",duomenys!$A16*duomenys!J16/MAX(duomenys!$F16:$O16),\"\")","v":""},{"$f":"IF(duomenys!$F16<>\"\",duomenys!$A16*duomenys!K16/MAX(duomenys!$F16:$O16),\"\")","v":""},{"$f":"IF(duomenys!$F16<>\"\",duomenys!$A16*duomenys!L16/MAX(duomenys!$F16:$O16),\"\")","v":""},{"$f":"IF(duomenys!$F16<>\"\",duomenys!$A16*duomenys!M16/MAX(duomenys!$F16:$O16),\"\")","v":""},{"$f":"IF(duomenys!$F16<>\"\",duomenys!$A16*duomenys!N16/MAX(duomenys!$F16:$O16),\"\")","v":""},{"$f":"IF(duomenys!$F16<>\"\",duomenys!$A16*duomenys!O16/MAX(duomenys!$F16:$O16),\"\")","v":""}]
[{"$f":"IF(duomenys!$F18<>\"\",duomenys!$A18*duomenys!F18/MAX(duomenys!$F18:$O18),\"\")","v":""},{"$f":"IF(duomenys!$F18<>\"\",duomenys!$A18*duomenys!G18/MAX(duomenys!$F18:$O18),\"\")","v":""},{"$f":"IF(duomenys!$F18<>\"\",duomenys!$A18*duomenys!H18/MAX(duomenys!$F18:$O18),\"\")","v":""},{"$f":"IF(duomenys!$F18<>\"\",duomenys!$A18*duomenys!I18/MAX(duomenys!$F18:$O18),\"\")","v":""},{"$f":"IF(duomenys!$F18<>\"\",duomenys!$A18*duomenys!J18/MAX(duomenys!$F18:$O18),\"\")","v":""},{"$f":"IF(duomenys!$F18<>\"\",duomenys!$A18*duomenys!K18/MAX(duomenys!$F18:$O18),\"\")","v":""},{"$f":"IF(duomenys!$F18<>\"\",duomenys!$A18*duomenys!L18/MAX(duomenys!$F18:$O18),\"\")","v":""},{"$f":"IF(duomenys!$F18<>\"\",duomenys!$A18*duomenys!M18/MAX(duomenys!$F18:$O18),\"\")","v":""},{"$f":"IF(duomenys!$F18<>\"\",duomenys!$A18*duomenys!N18/MAX(duomenys!$F18:$O18),\"\")","v":""},{"$f":"IF(duomenys!$F18<>\"\",duomenys!$A18*duomenys!O18/MAX(duomenys!$F18:$O18),\"\")","v":""}]
[{"$f":"IF(duomenys!$F20<>\"\",duomenys!$A20*duomenys!F20/MAX(duomenys!$F20:$O20),\"\")","v":""},{"$f":"IF(duomenys!$F20<>\"\",duomenys!$A20*duomenys!G20/MAX(duomenys!$F20:$O20),\"\")","v":""},{"$f":"IF(duomenys!$F20<>\"\",duomenys!$A20*duomenys!H20/MAX(duomenys!$F20:$O20),\"\")","v":""},{"$f":"IF(duomenys!$F20<>\"\",duomenys!$A20*duomenys!I20/MAX(duomenys!$F20:$O20),\"\")","v":""},{"$f":"IF(duomenys!$F20<>\"\",duomenys!$A20*duomenys!J20/MAX(duomenys!$F20:$O20),\"\")","v":""},{"$f":"IF(duomenys!$F20<>\"\",duomenys!$A20*duomenys!K20/MAX(duomenys!$F20:$O20),\"\")","v":""},{"$f":"IF(duomenys!$F20<>\"\",duomenys!$A20*duomenys!L20/MAX(duomenys!$F20:$O20),\"\")","v":""},{"$f":"IF(duomenys!$F20<>\"\",duomenys!$A20*duomenys!M20/MAX(duomenys!$F20:$O20),\"\")","v":""},{"$f":"IF(duomenys!$F20<>\"\",duomenys!$A20*duomenys!N20/MAX(duomenys!$F20:$O20),\"\")","v":""},{"$f":"IF(duomenys!$F20<>\"\",duomenys!$A20*duomenys!O20/MAX(duomenys!$F20:$O20),\"\")","v":""}]
[{"$f":"IF(duomenys!$F22<>\"\",duomenys!$A22*duomenys!F22/MAX(duomenys!$F22:$O22),\"\")","v":""},{"$f":"IF(duomenys!$F22<>\"\",duomenys!$A22*duomenys!G22/MAX(duomenys!$F22:$O22),\"\")","v":""},{"$f":"IF(duomenys!$F22<>\"\",duomenys!$A22*duomenys!H22/MAX(duomenys!$F22:$O22),\"\")","v":""},{"$f":"IF(duomenys!$F22<>\"\",duomenys!$A22*duomenys!I22/MAX(duomenys!$F22:$O22),\"\")","v":""},{"$f":"IF(duomenys!$F22<>\"\",duomenys!$A22*duomenys!J22/MAX(duomenys!$F22:$O22),\"\")","v":""},{"$f":"IF(duomenys!$F22<>\"\",duomenys!$A22*duomenys!K22/MAX(duomenys!$F22:$O22),\"\")","v":""},{"$f":"IF(duomenys!$F22<>\"\",duomenys!$A22*duomenys!L22/MAX(duomenys!$F22:$O22),\"\")","v":""},{"$f":"IF(duomenys!$F22<>\"\",duomenys!$A22*duomenys!M22/MAX(duomenys!$F22:$O22),\"\")","v":""},{"$f":"IF(duomenys!$F22<>\"\",duomenys!$A22*duomenys!N22/MAX(duomenys!$F22:$O22),\"\")","v":""},{"$f":"IF(duomenys!$F22<>\"\",duomenys!$A22*duomenys!O22/MAX(duomenys!$F22:$O22),\"\")","v":""}]
[{"$f":"IF(duomenys!$F24<>\"\",duomenys!$A24*duomenys!F24/MAX(duomenys!$F24:$O24),\"\")","v":""},{"$f":"IF(duomenys!$F24<>\"\",duomenys!$A24*duomenys!G24/MAX(duomenys!$F24:$O24),\"\")","v":""},{"$f":"IF(duomenys!$F24<>\"\",duomenys!$A24*duomenys!H24/MAX(duomenys!$F24:$O24),\"\")","v":""},{"$f":"IF(duomenys!$F24<>\"\",duomenys!$A24*duomenys!I24/MAX(duomenys!$F24:$O24),\"\")","v":""},{"$f":"IF(duomenys!$F24<>\"\",duomenys!$A24*duomenys!J24/MAX(duomenys!$F24:$O24),\"\")","v":""},{"$f":"IF(duomenys!$F24<>\"\",duomenys!$A24*duomenys!K24/MAX(duomenys!$F24:$O24),\"\")","v":""},{"$f":"IF(duomenys!$F24<>\"\",duomenys!$A24*duomenys!L24/MAX(duomenys!$F24:$O24),\"\")","v":""},{"$f":"IF(duomenys!$F24<>\"\",duomenys!$A24*duomenys!M24/MAX(duomenys!$F24:$O24),\"\")","v":""},{"$f":"IF(duomenys!$F24<>\"\",duomenys!$A24*duomenys!N24/MAX(duomenys!$F24:$O24),\"\")","v":""},{"$f":"IF(duomenys!$F24<>\"\",duomenys!$A24*duomenys!O24/MAX(duomenys!$F24:$O24),\"\")","v":""}]
[{"$f":"IF(duomenys!$F26<>\"\",duomenys!$A26*duomenys!F26/MAX(duomenys!$F26:$O26),\"\")","v":""},{"$f":"IF(duomenys!$F26<>\"\",duomenys!$A26*duomenys!G26/MAX(duomenys!$F26:$O26),\"\")","v":""},{"$f":"IF(duomenys!$F26<>\"\",duomenys!$A26*duomenys!H26/MAX(duomenys!$F26:$O26),\"\")","v":""},{"$f":"IF(duomenys!$F26<>\"\",duomenys!$A26*duomenys!I26/MAX(duomenys!$F26:$O26),\"\")","v":""},{"$f":"IF(duomenys!$F26<>\"\",duomenys!$A26*duomenys!J26/MAX(duomenys!$F26:$O26),\"\")","v":""},{"$f":"IF(duomenys!$F26<>\"\",duomenys!$A26*duomenys!K26/MAX(duomenys!$F26:$O26),\"\")","v":""},{"$f":"IF(duomenys!$F26<>\"\",duomenys!$A26*duomenys!L26/MAX(duomenys!$F26:$O26),\"\")","v":""},{"$f":"IF(duomenys!$F26<>\"\",duomenys!$A26*duomenys!M26/MAX(duomenys!$F26:$O26),\"\")","v":""},{"$f":"IF(duomenys!$F26<>\"\",duomenys!$A26*duomenys!N26/MAX(duomenys!$F26:$O26),\"\")","v":""},{"$f":"IF(duomenys!$F26<>\"\",duomenys!$A26*duomenys!O26/MAX(duomenys!$F26:$O26),\"\")","v":""}]
[{"$f":"IF(duomenys!$F28<>\"\",duomenys!$A28*duomenys!F28/MAX(duomenys!$F28:$O28),\"\")","v":""},{"$f":"IF(duomenys!$F28<>\"\",duomenys!$A28*duomenys!G28/MAX(duomenys!$F28:$O28),\"\")","v":""},{"$f":"IF(duomenys!$F28<>\"\",duomenys!$A28*duomenys!H28/MAX(duomenys!$F28:$O28),\"\")","v":""},{"$f":"IF(duomenys!$F28<>\"\",duomenys!$A28*duomenys!I28/MAX(duomenys!$F28:$O28),\"\")","v":""},{"$f":"IF(duomenys!$F28<>\"\",duomenys!$A28*duomenys!J28/MAX(duomenys!$F28:$O28),\"\")","v":""},{"$f":"IF(duomenys!$F28<>\"\",duomenys!$A28*duomenys!K28/MAX(duomenys!$F28:$O28),\"\")","v":""},{"$f":"IF(duomenys!$F28<>\"\",duomenys!$A28*duomenys!L28/MAX(duomenys!$F28:$O28),\"\")","v":""},{"$f":"IF(duomenys!$F28<>\"\",duomenys!$A28*duomenys!M28/MAX(duomenys!$F28:$O28),\"\")","v":""},{"$f":"IF(duomenys!$F28<>\"\",duomenys!$A28*duomenys!N28/MAX(duomenys!$F28:$O28),\"\")","v":""},{"$f":"IF(duomenys!$F28<>\"\",duomenys!$A28*duomenys!O28/MAX(duomenys!$F28:$O28),\"\")","v":""}]
[{"$f":"IF(duomenys!$F30<>\"\",duomenys!$A30*duomenys!F30/MAX(duomenys!$F30:$O30),\"\")","v":""},{"$f":"IF(duomenys!$F30<>\"\",duomenys!$A30*duomenys!G30/MAX(duomenys!$F30:$O30),\"\")","v":""},{"$f":"IF(duomenys!$F30<>\"\",duomenys!$A30*duomenys!H30/MAX(duomenys!$F30:$O30),\"\")","v":""},{"$f":"IF(duomenys!$F30<>\"\",duomenys!$A30*duomenys!I30/MAX(duomenys!$F30:$O30),\"\")","v":""},{"$f":"IF(duomenys!$F30<>\"\",duomenys!$A30*duomenys!J30/MAX(duomenys!$F30:$O30),\"\")","v":""},{"$f":"IF(duomenys!$F30<>\"\",duomenys!$A30*duomenys!K30/MAX(duomenys!$F30:$O30),\"\")","v":""},{"$f":"IF(duomenys!$F30<>\"\",duomenys!$A30*duomenys!L30/MAX(duomenys!$F30:$O30),\"\")","v":""},{"$f":"IF(duomenys!$F30<>\"\",duomenys!$A30*duomenys!M30/MAX(duomenys!$F30:$O30),\"\")","v":""},{"$f":"IF(duomenys!$F30<>\"\",duomenys!$A30*duomenys!N30/MAX(duomenys!$F30:$O30),\"\")","v":""},{"$f":"IF(duomenys!$F30<>\"\",duomenys!$A30*duomenys!O30/MAX(duomenys!$F30:$O30),\"\")","v":""}]
[]
[]
[]
[]
[]
[{"$f":"IF(duomenys!$F31<>\"\",duomenys!$A31*duomenys!F31/MAX(duomenys!$F31:$O31),\"\")","v":""},{"$f":"IF(duomenys!$F31<>\"\",duomenys!$A31*duomenys!G31/MAX(duomenys!$F31:$O31),\"\")","v":""},{"$f":"IF(duomenys!$F31<>\"\",duomenys!$A31*duomenys!H31/MAX(duomenys!$F31:$O31),\"\")","v":""},{"$f":"IF(duomenys!$F31<>\"\",duomenys!$A31*duomenys!I31/MAX(duomenys!$F31:$O31),\"\")","v":""},{"$f":"IF(duomenys!$F31<>\"\",duomenys!$A31*duomenys!J31/MAX(duomenys!$F31:$O31),\"\")","v":""},{"$f":"IF(duomenys!$F31<>\"\",duomenys!$A31*duomenys!K31/MAX(duomenys!$F31:$O31),\"\")","v":""},{"$f":"IF(duomenys!$F31<>\"\",duomenys!$A31*duomenys!L31/MAX(duomenys!$F31:$O31),\"\")","v":""},{"$f":"IF(duomenys!$F31<>\"\",duomenys!$A31*duomenys!M31/MAX(duomenys!$F31:$O31),\"\")","v":""},{"$f":"IF(duomenys!$F31<>\"\",duomenys!$A31*duomenys!N31/MAX(duomenys!$F31:$O31),\"\")","v":""},{"$f":"IF(duomenys!$F31<>\"\",duomenys!$A31*duomenys!O31/MAX(duomenys!$F31:$O31),\"\")","v":""}]

{"sheet":"2","index":8,"n_rows":10,"n_cols":10,"rows_kept":10,"cut":false,"hidden":true,"merged":[]}
[{"$f":"IF(duomenys!$F12<>\"\",MIN(duomenys!$F12:$O12)/duomenys!F12*duomenys!$A12,\"\")","v":""},{"$f":"IF(duomenys!$F12<>\"\",MIN(duomenys!$F12:$O12)/duomenys!G12*duomenys!$A12,\"\")","v":""},{"$f":"IF(duomenys!$F12<>\"\",MIN(duomenys!$F12:$O12)/duomenys!H12*duomenys!$A12,\"\")","v":""},{"$f":"IF(duomenys!$F12<>\"\",MIN(duomenys!$F12:$O12)/duomenys!I12*duomenys!$A12,\"\")","v":""},{"$f":"IF(duomenys!$F12<>\"\",MIN(duomenys!$F12:$O12)/duomenys!J12*duomenys!$A12,\"\")","v":""},{"$f":"IF(duomenys!$F12<>\"\",MIN(duomenys!$F12:$O12)/duomenys!K12*duomenys!$A12,\"\")","v":""},{"$f":"IF(duomenys!$F12<>\"\",MIN(duomenys!$F12:$O12)/duomenys!L12*duomenys!$A12,\"\")","v":""},{"$f":"IF(duomenys!$F12<>\"\",MIN(duomenys!$F12:$O12)/duomenys!M12*duomenys!$A12,\"\")","v":""},{"$f":"IF(duomenys!$F12<>\"\",MIN(duomenys!$F12:$O12)/duomenys!N12*duomenys!$A12,\"\")","v":""},{"$f":"IF(duomenys!$F12<>\"\",MIN(duomenys!$F12:$O12)/duomenys!O12*duomenys!$A12,\"\")","v":""}]
[{"$f":"IF(duomenys!$F14<>\"\",MIN(duomenys!$F14:$O14)/duomenys!F14*duomenys!$A14,\"\")","v":""},{"$f":"IF(duomenys!$F14<>\"\",MIN(duomenys!$F14:$O14)/duomenys!G14*duomenys!$A14,\"\")","v":""},{"$f":"IF(duomenys!$F14<>\"\",MIN(duomenys!$F14:$O14)/duomenys!H14*duomenys!$A14,\"\")","v":""},{"$f":"IF(duomenys!$F14<>\"\",MIN(duomenys!$F14:$O14)/duomenys!I14*duomenys!$A14,\"\")","v":""},{"$f":"IF(duomenys!$F14<>\"\",MIN(duomenys!$F14:$O14)/duomenys!J14*duomenys!$A14,\"\")","v":""},{"$f":"IF(duomenys!$F14<>\"\",MIN(duomenys!$F14:$O14)/duomenys!K14*duomenys!$A14,\"\")","v":""},{"$f":"IF(duomenys!$F14<>\"\",MIN(duomenys!$F14:$O14)/duomenys!L14*duomenys!$A14,\"\")","v":""},{"$f":"IF(duomenys!$F14<>\"\",MIN(duomenys!$F14:$O14)/duomenys!M14*duomenys!$A14,\"\")","v":""},{"$f":"IF(duomenys!$F14<>\"\",MIN(duomenys!$F14:$O14)/duomenys!N14*duomenys!$A14,\"\")","v":""},{"$f":"IF(duomenys!$F14<>\"\",MIN(duomenys!$F14:$O14)/duomenys!O14*duomenys!$A14,\"\")","v":""}]
[{"$f":"IF(duomenys!$F16<>\"\",MIN(duomenys!$F16:$O16)/duomenys!F16*duomenys!$A16,\"\")","v":""},{"$f":"IF(duomenys!$F16<>\"\",MIN(duomenys!$F16:$O16)/duomenys!G16*duomenys!$A16,\"\")","v":""},{"$f":"IF(duomenys!$F16<>\"\",MIN(duomenys!$F16:$O16)/duomenys!H16*duomenys!$A16,\"\")","v":""},{"$f":"IF(duomenys!$F16<>\"\",MIN(duomenys!$F16:$O16)/duomenys!I16*duomenys!$A16,\"\")","v":""},{"$f":"IF(duomenys!$F16<>\"\",MIN(duomenys!$F16:$O16)/duomenys!J16*duomenys!$A16,\"\")","v":""},{"$f":"IF(duomenys!$F16<>\"\",MIN(duomenys!$F16:$O16)/duomenys!K16*duomenys!$A16,\"\")","v":""},{"$f":"IF(duomenys!$F16<>\"\",MIN(duomenys!$F16:$O16)/duomenys!L16*duomenys!$A16,\"\")","v":""},{"$f":"IF(duomenys!$F16<>\"\",MIN(duomenys!$F16:$O16)/duomenys!M16*duomenys!$A16,\"\")","v":""},{"$f":"IF(duomenys!$F16<>\"\",MIN(duomenys!$F16:$O16)/duomenys!N16*duomenys!$A16,\"\")","v":""},{"$f":"IF(duomenys!$F16<>\"\",MIN(duomenys!$F16:$O16)/duomenys!O16*duomenys!$A16,\"\")","v":""}]
[{"$f":"IF(duomenys!$F18<>\"\",MIN(duomenys!$F18:$O18)/duomenys!F18*duomenys!$A18,\"\")","v":""},{"$f":"IF(duomenys!$F18<>\"\",MIN(duomenys!$F18:$O18)/duomenys!G18*duomenys!$A18,\"\")","v":""},{"$f":"IF(duomenys!$F18<>\"\",MIN(duomenys!$F18:$O18)/duomenys!H18*duomenys!$A18,\"\")","v":""},{"$f":"IF(duomenys!$F18<>\"\",MIN(duomenys!$F18:$O18)/duomenys!I18*duomenys!$A18,\"\")","v":""},{"$f":"IF(duomenys!$F18<>\"\",MIN(duomenys!$F18:$O18)/duomenys!J18*duomenys!$A18,\"\")","v":""},{"$f":"IF(duomenys!$F18<>\"\",MIN(duomenys!$F18:$O18)/duomenys!K18*duomenys!$A18,\"\")","v":""},{"$f":"IF(duomenys!$F18<>\"\",MIN(duomenys!$F18:$O18)/duomenys!L18*duomenys!$A18,\"\")","v":""},{"$f":"IF(duomenys!$F18<>\"\",MIN(duomenys!$F18:$O18)/duomenys!M18*duomenys!$A18,\"\")","v":""},{"$f":"IF(duomenys!$F18<>\"\",MIN(duomenys!$F18:$O18)/duomenys!N18*duomenys!$A18,\"\")","v":""},{"$f":"IF(duomenys!$F18<>\"\",MIN(duomenys!$F18:$O18)/duomenys!O18*duomenys!$A18,\"\")","v":""}]
[{"$f":"IF(duomenys!$F20<>\"\",MIN(duomenys!$F20:$O20)/duomenys!F20*duomenys!$A20,\"\")","v":""},{"$f":"IF(duomenys!$F20<>\"\",MIN(duomenys!$F20:$O20)/duomenys!G20*duomenys!$A20,\"\")","v":""},{"$f":"IF(duomenys!$F20<>\"\",MIN(duomenys!$F20:$O20)/duomenys!H20*duomenys!$A20,\"\")","v":""},{"$f":"IF(duomenys!$F20<>\"\",MIN(duomenys!$F20:$O20)/duomenys!I20*duomenys!$A20,\"\")","v":""},{"$f":"IF(duomenys!$F20<>\"\",MIN(duomenys!$F20:$O20)/duomenys!J20*duomenys!$A20,\"\")","v":""},{"$f":"IF(duomenys!$F20<>\"\",MIN(duomenys!$F20:$O20)/duomenys!K20*duomenys!$A20,\"\")","v":""},{"$f":"IF(duomenys!$F20<>\"\",MIN(duomenys!$F20:$O20)/duomenys!L20*duomenys!$A20,\"\")","v":""},{"$f":"IF(duomenys!$F20<>\"\",MIN(duomenys!$F20:$O20)/duomenys!M20*duomenys!$A20,\"\")","v":""},{"$f":"IF(duomenys!$F20<>\"\",MIN(duomenys!$F20:$O20)/duomenys!N20*duomenys!$A20,\"\")","v":""},{"$f":"IF(duomenys!$F20<>\"\",MIN(duomenys!$F20:$O20)/duomenys!O20*duomenys!$A20,\"\")","v":""}]
[{"$f":"IF(duomenys!$F22<>\"\",MIN(duomenys!$F22:$O22)/duomenys!F22*duomenys!$A22,\"\")","v":""},{"$f":"IF(duomenys!$F22<>\"\",MIN(duomenys!$F22:$O22)/duomenys!G22*duomenys!$A22,\"\")","v":""},{"$f":"IF(duomenys!$F22<>\"\",MIN(duomenys!$F22:$O22)/duomenys!H22*duomenys!$A22,\"\")","v":""},{"$f":"IF(duomenys!$F22<>\"\",MIN(duomenys!$F22:$O22)/duomenys!I22*duomenys!$A22,\"\")","v":""},{"$f":"IF(duomenys!$F22<>\"\",MIN(duomenys!$F22:$O22)/duomenys!J22*duomenys!$A22,\"\")","v":""},{"$f":"IF(duomenys!$F22<>\"\",MIN(duomenys!$F22:$O22)/duomenys!K22*duomenys!$A22,\"\")","v":""},{"$f":"IF(duomenys!$F22<>\"\",MIN(duomenys!$F22:$O22)/duomenys!L22*duomenys!$A22,\"\")","v":""},{"$f":"IF(duomenys!$F22<>\"\",MIN(duomenys!$F22:$O22)/duomenys!M22*duomenys!$A22,\"\")","v":""},{"$f":"IF(duomenys!$F22<>\"\",MIN(duomenys!$F22:$O22)/duomenys!N22*duomenys!$A22,\"\")","v":""},{"$f":"IF(duomenys!$F22<>\"\",MIN(duomenys!$F22:$O22)/duomenys!O22*duomenys!$A22,\"\")","v":""}]
[{"$f":"IF(duomenys!$F24<>\"\",MIN(duomenys!$F24:$O24)/duomenys!F24*duomenys!$A24,\"\")","v":""},{"$f":"IF(duomenys!$F24<>\"\",MIN(duomenys!$F24:$O24)/duomenys!G24*duomenys!$A24,\"\")","v":""},{"$f":"IF(duomenys!$F24<>\"\",MIN(duomenys!$F24:$O24)/duomenys!H24*duomenys!$A24,\"\")","v":""},{"$f":"IF(duomenys!$F24<>\"\",MIN(duomenys!$F24:$O24)/duomenys!I24*duomenys!$A24,\"\")","v":""},{"$f":"IF(duomenys!$F24<>\"\",MIN(duomenys!$F24:$O24)/duomenys!J24*duomenys!$A24,\"\")","v":""},{"$f":"IF(duomenys!$F24<>\"\",MIN(duomenys!$F24:$O24)/duomenys!K24*duomenys!$A24,\"\")","v":""},{"$f":"IF(duomenys!$F24<>\"\",MIN(duomenys!$F24:$O24)/duomenys!L24*duomenys!$A24,\"\")","v":""},{"$f":"IF(duomenys!$F24<>\"\",MIN(duomenys!$F24:$O24)/duomenys!M24*duomenys!$A24,\"\")","v":""},{"$f":"IF(duomenys!$F24<>\"\",MIN(duomenys!$F24:$O24)/duomenys!N24*duomenys!$A24,\"\")","v":""},{"$f":"IF(duomenys!$F24<>\"\",MIN(duomenys!$F24:$O24)/duomenys!O24*duomenys!$A24,\"\")","v":""}]
[{"$f":"IF(duomenys!$F26<>\"\",MIN(duomenys!$F26:$O26)/duomenys!F26*duomenys!$A26,\"\")","v":""},{"$f":"IF(duomenys!$F26<>\"\",MIN(duomenys!$F26:$O26)/duomenys!G26*duomenys!$A26,\"\")","v":""},{"$f":"IF(duomenys!$F26<>\"\",MIN(duomenys!$F26:$O26)/duomenys!H26*duomenys!$A26,\"\")","v":""},{"$f":"IF(duomenys!$F26<>\"\",MIN(duomenys!$F26:$O26)/duomenys!I26*duomenys!$A26,\"\")","v":""},{"$f":"IF(duomenys!$F26<>\"\",MIN(duomenys!$F26:$O26)/duomenys!J26*duomenys!$A26,\"\")","v":""},{"$f":"IF(duomenys!$F26<>\"\",MIN(duomenys!$F26:$O26)/duomenys!K26*duomenys!$A26,\"\")","v":""},{"$f":"IF(duomenys!$F26<>\"\",MIN(duomenys!$F26:$O26)/duomenys!L26*duomenys!$A26,\"\")","v":""},{"$f":"IF(duomenys!$F26<>\"\",MIN(duomenys!$F26:$O26)/duomenys!M26*duomenys!$A26,\"\")","v":""},{"$f":"IF(duomenys!$F26<>\"\",MIN(duomenys!$F26:$O26)/duomenys!N26*duomenys!$A26,\"\")","v":""},{"$f":"IF(duomenys!$F26<>\"\",MIN(duomenys!$F26:$O26)/duomenys!O26*duomenys!$A26,\"\")","v":""}]
[{"$f":"IF(duomenys!$F28<>\"\",MIN(duomenys!$F28:$O28)/duomenys!F28*duomenys!$A28,\"\")","v":""},{"$f":"IF(duomenys!$F28<>\"\",MIN(duomenys!$F28:$O28)/duomenys!G28*duomenys!$A28,\"\")","v":""},{"$f":"IF(duomenys!$F28<>\"\",MIN(duomenys!$F28:$O28)/duomenys!H28*duomenys!$A28,\"\")","v":""},{"$f":"IF(duomenys!$F28<>\"\",MIN(duomenys!$F28:$O28)/duomenys!I28*duomenys!$A28,\"\")","v":""},{"$f":"IF(duomenys!$F28<>\"\",MIN(duomenys!$F28:$O28)/duomenys!J28*duomenys!$A28,\"\")","v":""},{"$f":"IF(duomenys!$F28<>\"\",MIN(duomenys!$F28:$O28)/duomenys!K28*duomenys!$A28,\"\")","v":""},{"$f":"IF(duomenys!$F28<>\"\",MIN(duomenys!$F28:$O28)/duomenys!L28*duomenys!$A28,\"\")","v":""},{"$f":"IF(duomenys!$F28<>\"\",MIN(duomenys!$F28:$O28)/duomenys!M28*duomenys!$A28,\"\")","v":""},{"$f":"IF(duomenys!$F28<>\"\",MIN(duomenys!$F28:$O28)/duomenys!N28*duomenys!$A28,\"\")","v":""},{"$f":"IF(duomenys!$F28<>\"\",MIN(duomenys!$F28:$O28)/duomenys!O28*duomenys!$A28,\"\")","v":""}]
[{"$f":"IF(duomenys!$F30<>\"\",MIN(duomenys!$F30:$O30)/duomenys!F30*duomenys!$A30,\"\")","v":""},{"$f":"IF(duomenys!$F30<>\"\",MIN(duomenys!$F30:$O30)/duomenys!G30*duomenys!$A30,\"\")","v":""},{"$f":"IF(duomenys!$F30<>\"\",MIN(duomenys!$F30:$O30)/duomenys!H30*duomenys!$A30,\"\")","v":""},{"$f":"IF(duomenys!$F30<>\"\",MIN(duomenys!$F30:$O30)/duomenys!I30*duomenys!$A30,\"\")","v":""},{"$f":"IF(duomenys!$F30<>\"\",MIN(duomenys!$F30:$O30)/duomenys!J30*duomenys!$A30,\"\")","v":""},{"$f":"IF(duomenys!$F30<>\"\",MIN(duomenys!$F30:$O30)/duomenys!K30*duomenys!$A30,\"\")","v":""},{"$f":"IF(duomenys!$F30<>\"\",MIN(duomenys!$F30:$O30)/duomenys!L30*duomenys!$A30,\"\")","v":""},{"$f":"IF(duomenys!$F30<>\"\",MIN(duomenys!$F30:$O30)/duomenys!M30*duomenys!$A30,\"\")","v":""},{"$f":"IF(duomenys!$F30<>\"\",MIN(duomenys!$F30:$O30)/duomenys!N30*duomenys!$A30,\"\")","v":""},{"$f":"IF(duomenys!$F30<>\"\",MIN(duomenys!$F30:$O30)/duomenys!O30*duomenys!$A30,\"\")","v":""}]

{"sheet":"3","index":9,"n_rows":10,"n_cols":10,"rows_kept":10,"cut":false,"hidden":true,"merged":[]}
[{"$f":"IF(duomenys!$F12<>\"\",IF(duomenys!F12=\"Taip\",duomenys!$A12,),\"\")","v":""},{"$f":"IF(duomenys!$F12<>\"\",IF(duomenys!G12=\"Taip\",duomenys!$A12,),\"\")","v":""},{"$f":"IF(duomenys!$F12<>\"\",IF(duomenys!H12=\"Taip\",duomenys!$A12,),\"\")","v":""},{"$f":"IF(duomenys!$F12<>\"\",IF(duomenys!I12=\"Taip\",duomenys!$A12,),\"\")","v":""},{"$f":"IF(duomenys!$F12<>\"\",IF(duomenys!J12=\"Taip\",duomenys!$A12,),\"\")","v":""},{"$f":"IF(duomenys!$F12<>\"\",IF(duomenys!K12=\"Taip\",duomenys!$A12,),\"\")","v":""},{"$f":"IF(duomenys!$F12<>\"\",IF(duomenys!L12=\"Taip\",duomenys!$A12,),\"\")","v":""},{"$f":"IF(duomenys!$F12<>\"\",IF(duomenys!M12=\"Taip\",duomenys!$A12,),\"\")","v":""},{"$f":"IF(duomenys!$F12<>\"\",IF(duomenys!N12=\"Taip\",duomenys!$A12,),\"\")","v":""},{"$f":"IF(duomenys!$F12<>\"\",IF(duomenys!O12=\"Taip\",duomenys!$A12,),\"\")","v":""}]
[{"$f":"IF(duomenys!$F14<>\"\",IF(duomenys!F14=\"Taip\",duomenys!$A14,),\"\")","v":""},{"$f":"IF(duomenys!$F14<>\"\",IF(duomenys!G14=\"Taip\",duomenys!$A14,),\"\")","v":""},{"$f":"IF(duomenys!$F14<>\"\",IF(duomenys!H14=\"Taip\",duomenys!$A14,),\"\")","v":""},{"$f":"IF(duomenys!$F14<>\"\",IF(duomenys!I14=\"Taip\",duomenys!$A14,),\"\")","v":""},{"$f":"IF(duomenys!$F14<>\"\",IF(duomenys!J14=\"Taip\",duomenys!$A14,),\"\")","v":""},{"$f":"IF(duomenys!$F14<>\"\",IF(duomenys!K14=\"Taip\",duomenys!$A14,),\"\")","v":""},{"$f":"IF(duomenys!$F14<>\"\",IF(duomenys!L14=\"Taip\",duomenys!$A14,),\"\")","v":""},{"$f":"IF(duomenys!$F14<>\"\",IF(duomenys!M14=\"Taip\",duomenys!$A14,),\"\")","v":""},{"$f":"IF(duomenys!$F14<>\"\",IF(duomenys!N14=\"Taip\",duomenys!$A14,),\"\")","v":""},{"$f":"IF(duomenys!$F14<>\"\",IF(duomenys!O14=\"Taip\",duomenys!$A14,),\"\")","v":""}]
[{"$f":"IF(duomenys!$F16<>\"\",IF(duomenys!F16=\"Taip\",duomenys!$A16,),\"\")","v":""},{"$f":"IF(duomenys!$F16<>\"\",IF(duomenys!G16=\"Taip\",duomenys!$A16,),\"\")","v":""},{"$f":"IF(duomenys!$F16<>\"\",IF(duomenys!H16=\"Taip\",duomenys!$A16,),\"\")","v":""},{"$f":"IF(duomenys!$F16<>\"\",IF(duomenys!I16=\"Taip\",duomenys!$A16,),\"\")","v":""},{"$f":"IF(duomenys!$F16<>\"\",IF(duomenys!J16=\"Taip\",duomenys!$A16,),\"\")","v":""},{"$f":"IF(duomenys!$F16<>\"\",IF(duomenys!K16=\"Taip\",duomenys!$A16,),\"\")","v":""},{"$f":"IF(duomenys!$F16<>\"\",IF(duomenys!L16=\"Taip\",duomenys!$A16,),\"\")","v":""},{"$f":"IF(duomenys!$F16<>\"\",IF(duomenys!M16=\"Taip\",duomenys!$A16,),\"\")","v":""},{"$f":"IF(duomenys!$F16<>\"\",IF(duomenys!N16=\"Taip\",duomenys!$A16,),\"\")","v":""},{"$f":"IF(duomenys!$F16<>\"\",IF(duomenys!O16=\"Taip\",duomenys!$A16,),\"\")","v":""}]
[{"$f":"IF(duomenys!$F18<>\"\",IF(duomenys!F18=\"Taip\",duomenys!$A18,),\"\")","v":""},{"$f":"IF(duomenys!$F18<>\"\",IF(duomenys!G18=\"Taip\",duomenys!$A18,),\"\")","v":""},{"$f":"IF(duomenys!$F18<>\"\",IF(duomenys!H18=\"Taip\",duomenys!$A18,),\"\")","v":""},{"$f":"IF(duomenys!$F18<>\"\",IF(duomenys!I18=\"Taip\",duomenys!$A18,),\"\")","v":""},{"$f":"IF(duomenys!$F18<>\"\",IF(duomenys!J18=\"Taip\",duomenys!$A18,),\"\")","v":""},{"$f":"IF(duomenys!$F18<>\"\",IF(duomenys!K18=\"Taip\",duomenys!$A18,),\"\")","v":""},{"$f":"IF(duomenys!$F18<>\"\",IF(duomenys!L18=\"Taip\",duomenys!$A18,),\"\")","v":""},{"$f":"IF(duomenys!$F18<>\"\",IF(duomenys!M18=\"Taip\",duomenys!$A18,),\"\")","v":""},{"$f":"IF(duomenys!$F18<>\"\",IF(duomenys!N18=\"Taip\",duomenys!$A18,),\"\")","v":""},{"$f":"IF(duomenys!$F18<>\"\",IF(duomenys!O18=\"Taip\",duomenys!$A18,),\"\")","v":""}]
[{"$f":"IF(duomenys!$F20<>\"\",IF(duomenys!F20=\"Taip\",duomenys!$A20,),\"\")","v":""},{"$f":"IF(duomenys!$F20<>\"\",IF(duomenys!G20=\"Taip\",duomenys!$A20,),\"\")","v":""},{"$f":"IF(duomenys!$F20<>\"\",IF(duomenys!H20=\"Taip\",duomenys!$A20,),\"\")","v":""},{"$f":"IF(duomenys!$F20<>\"\",IF(duomenys!I20=\"Taip\",duomenys!$A20,),\"\")","v":""},{"$f":"IF(duomenys!$F20<>\"\",IF(duomenys!J20=\"Taip\",duomenys!$A20,),\"\")","v":""},{"$f":"IF(duomenys!$F20<>\"\",IF(duomenys!K20=\"Taip\",duomenys!$A20,),\"\")","v":""},{"$f":"IF(duomenys!$F20<>\"\",IF(duomenys!L20=\"Taip\",duomenys!$A20,),\"\")","v":""},{"$f":"IF(duomenys!$F20<>\"\",IF(duomenys!M20=\"Taip\",duomenys!$A20,),\"\")","v":""},{"$f":"IF(duomenys!$F20<>\"\",IF(duomenys!N20=\"Taip\",duomenys!$A20,),\"\")","v":""},{"$f":"IF(duomenys!$F20<>\"\",IF(duomenys!O20=\"Taip\",duomenys!$A20,),\"\")","v":""}]
[{"$f":"IF(duomenys!$F22<>\"\",IF(duomenys!F22=\"Taip\",duomenys!$A22,),\"\")","v":""},{"$f":"IF(duomenys!$F22<>\"\",IF(duomenys!G22=\"Taip\",duomenys!$A22,),\"\")","v":""},{"$f":"IF(duomenys!$F22<>\"\",IF(duomenys!H22=\"Taip\",duomenys!$A22,),\"\")","v":""},{"$f":"IF(duomenys!$F22<>\"\",IF(duomenys!I22=\"Taip\",duomenys!$A22,),\"\")","v":""},{"$f":"IF(duomenys!$F22<>\"\",IF(duomenys!J22=\"Taip\",duomenys!$A22,),\"\")","v":""},{"$f":"IF(duomenys!$F22<>\"\",IF(duomenys!K22=\"Taip\",duomenys!$A22,),\"\")","v":""},{"$f":"IF(duomenys!$F22<>\"\",IF(duomenys!L22=\"Taip\",duomenys!$A22,),\"\")","v":""},{"$f":"IF(duomenys!$F22<>\"\",IF(duomenys!M22=\"Taip\",duomenys!$A22,),\"\")","v":""},{"$f":"IF(duomenys!$F22<>\"\",IF(duomenys!N22=\"Taip\",duomenys!$A22,),\"\")","v":""},{"$f":"IF(duomenys!$F22<>\"\",IF(duomenys!O22=\"Taip\",duomenys!$A22,),\"\")","v":""}]
[{"$f":"IF(duomenys!$F24<>\"\",IF(duomenys!F24=\"Taip\",duomenys!$A24,),\"\")","v":""},{"$f":"IF(duomenys!$F24<>\"\",IF(duomenys!G24=\"Taip\",duomenys!$A24,),\"\")","v":""},{"$f":"IF(duomenys!$F24<>\"\",IF(duomenys!H24=\"Taip\",duomenys!$A24,),\"\")","v":""},{"$f":"IF(duomenys!$F24<>\"\",IF(duomenys!I24=\"Taip\",duomenys!$A24,),\"\")","v":""},{"$f":"IF(duomenys!$F24<>\"\",IF(duomenys!J24=\"Taip\",duomenys!$A24,),\"\")","v":""},{"$f":"IF(duomenys!$F24<>\"\",IF(duomenys!K24=\"Taip\",duomenys!$A24,),\"\")","v":""},{"$f":"IF(duomenys!$F24<>\"\",IF(duomenys!L24=\"Taip\",duomenys!$A24,),\"\")","v":""},{"$f":"IF(duomenys!$F24<>\"\",IF(duomenys!M24=\"Taip\",duomenys!$A24,),\"\")","v":""},{"$f":"IF(duomenys!$F24<>\"\",IF(duomenys!N24=\"Taip\",duomenys!$A24,),\"\")","v":""},{"$f":"IF(duomenys!$F24<>\"\",IF(duomenys!O24=\"Taip\",duomenys!$A24,),\"\")","v":""}]
[{"$f":"IF(duomenys!$F26<>\"\",IF(duomenys!F26=\"Taip\",duomenys!$A26,),\"\")","v":""},{"$f":"IF(duomenys!$F26<>\"\",IF(duomenys!G26=\"Taip\",duomenys!$A26,),\"\")","v":""},{"$f":"IF(duomenys!$F26<>\"\",IF(duomenys!H26=\"Taip\",duomenys!$A26,),\"\")","v":""},{"$f":"IF(duomenys!$F26<>\"\",IF(duomenys!I26=\"Taip\",duomenys!$A26,),\"\")","v":""},{"$f":"IF(duomenys!$F26<>\"\",IF(duomenys!J26=\"Taip\",duomenys!$A26,),\"\")","v":""},{"$f":"IF(duomenys!$F26<>\"\",IF(duomenys!K26=\"Taip\",duomenys!$A26,),\"\")","v":""},{"$f":"IF(duomenys!$F26<>\"\",IF(duomenys!L26=\"Taip\",duomenys!$A26,),\"\")","v":""},{"$f":"IF(duomenys!$F26<>\"\",IF(duomenys!M26=\"Taip\",duomenys!$A26,),\"\")","v":""},{"$f":"IF(duomenys!$F26<>\"\",IF(duomenys!N26=\"Taip\",duomenys!$A26,),\"\")","v":""},{"$f":"IF(duomenys!$F26<>\"\",IF(duomenys!O26=\"Taip\",duomenys!$A26,),\"\")","v":""}]
[{"$f":"IF(duomenys!$F28<>\"\",IF(duomenys!F28=\"Taip\",duomenys!$A28,),\"\")","v":""},{"$f":"IF(duomenys!$F28<>\"\",IF(duomenys!G28=\"Taip\",duomenys!$A28,),\"\")","v":""},{"$f":"IF(duomenys!$F28<>\"\",IF(duomenys!H28=\"Taip\",duomenys!$A28,),\"\")","v":""},{"$f":"IF(duomenys!$F28<>\"\",IF(duomenys!I28=\"Taip\",duomenys!$A28,),\"\")","v":""},{"$f":"IF(duomenys!$F28<>\"\",IF(duomenys!J28=\"Taip\",duomenys!$A28,),\"\")","v":""},{"$f":"IF(duomenys!$F28<>\"\",IF(duomenys!K28=\"Taip\",duomenys!$A28,),\"\")","v":""},{"$f":"IF(duomenys!$F28<>\"\",IF(duomenys!L28=\"Taip\",duomenys!$A28,),\"\")","v":""},{"$f":"IF(duomenys!$F28<>\"\",IF(duomenys!M28=\"Taip\",duomenys!$A28,),\"\")","v":""},{"$f":"IF(duomenys!$F28<>\"\",IF(duomenys!N28=\"Taip\",duomenys!$A28,),\"\")","v":""},{"$f":"IF(duomenys!$F28<>\"\",IF(duomenys!O28=\"Taip\",duomenys!$A28,),\"\")","v":""}]
[{"$f":"IF(duomenys!$F30<>\"\",IF(duomenys!F30=\"Taip\",duomenys!$A30,),\"\")","v":""},{"$f":"IF(duomenys!$F30<>\"\",IF(duomenys!G30=\"Taip\",duomenys!$A30,),\"\")","v":""},{"$f":"IF(duomenys!$F30<>\"\",IF(duomenys!H30=\"Taip\",duomenys!$A30,),\"\")","v":""},{"$f":"IF(duomenys!$F30<>\"\",IF(duomenys!I30=\"Taip\",duomenys!$A30,),\"\")","v":""},{"$f":"IF(duomenys!$F30<>\"\",IF(duomenys!J30=\"Taip\",duomenys!$A30,),\"\")","v":""},{"$f":"IF(duomenys!$F30<>\"\",IF(duomenys!K30=\"Taip\",duomenys!$A30,),\"\")","v":""},{"$f":"IF(duomenys!$F30<>\"\",IF(duomenys!L30=\"Taip\",duomenys!$A30,),\"\")","v":""},{"$f":"IF(duomenys!$F30<>\"\",IF(duomenys!M30=\"Taip\",duomenys!$A30,),\"\")","v":""},{"$f":"IF(duomenys!$F30<>\"\",IF(duomenys!N30=\"Taip\",duomenys!$A30,),\"\")","v":""},{"$f":"IF(duomenys!$F30<>\"\",IF(duomenys!O30=\"Taip\",duomenys!$A30,),\"\")","v":""}]

{"sheet":"4","index":10,"n_rows":10,"n_cols":10,"rows_kept":10,"cut":false,"hidden":true,"merged":[]}
[{"$f":"IF(duomenys!$F12<>\"\",duomenys!F12,\"\")","v":""},{"$f":"IF(duomenys!$F12<>\"\",duomenys!G12,\"\")","v":""},{"$f":"IF(duomenys!$F12<>\"\",duomenys!H12,\"\")","v":""},{"$f":"IF(duomenys!$F12<>\"\",duomenys!I12,\"\")","v":""},{"$f":"IF(duomenys!$F12<>\"\",duomenys!J12,\"\")","v":""},{"$f":"IF(duomenys!$F12<>\"\",duomenys!K12,\"\")","v":""},{"$f":"IF(duomenys!$F12<>\"\",duomenys!L12,\"\")","v":""},{"$f":"IF(duomenys!$F12<>\"\",duomenys!M12,\"\")","v":""},{"$f":"IF(duomenys!$F12<>\"\",duomenys!N12,\"\")","v":""},{"$f":"IF(duomenys!$F12<>\"\",duomenys!O12,\"\")","v":""}]
[{"$f":"IF(duomenys!$F14<>\"\",duomenys!F14,\"\")","v":""},{"$f":"IF(duomenys!$F14<>\"\",duomenys!G14,\"\")","v":""},{"$f":"IF(duomenys!$F14<>\"\",duomenys!H14,\"\")","v":""},{"$f":"IF(duomenys!$F14<>\"\",duomenys!I14,\"\")","v":""},{"$f":"IF(duomenys!$F14<>\"\",duomenys!J14,\"\")","v":""},{"$f":"IF(duomenys!$F14<>\"\",duomenys!K14,\"\")","v":""},{"$f":"IF(duomenys!$F14<>\"\",duomenys!L14,\"\")","v":""},{"$f":"IF(duomenys!$F14<>\"\",duomenys!M14,\"\")","v":""},{"$f":"IF(duomenys!$F14<>\"\",duomenys!N14,\"\")","v":""},{"$f":"IF(duomenys!$F14<>\"\",duomenys!O14,\"\")","v":""}]
[{"$f":"IF(duomenys!$F16<>\"\",duomenys!F16,\"\")","v":""},{"$f":"IF(duomenys!$F16<>\"\",duomenys!G16,\"\")","v":""},{"$f":"IF(duomenys!$F16<>\"\",duomenys!H16,\"\")","v":""},{"$f":"IF(duomenys!$F16<>\"\",duomenys!I16,\"\")","v":""},{"$f":"IF(duomenys!$F16<>\"\",duomenys!J16,\"\")","v":""},{"$f":"IF(duomenys!$F16<>\"\",duomenys!K16,\"\")","v":""},{"$f":"IF(duomenys!$F16<>\"\",duomenys!L16,\"\")","v":""},{"$f":"IF(duomenys!$F16<>\"\",duomenys!M16,\"\")","v":""},{"$f":"IF(duomenys!$F16<>\"\",duomenys!N16,\"\")","v":""},{"$f":"IF(duomenys!$F16<>\"\",duomenys!O16,\"\")","v":""}]
[{"$f":"IF(duomenys!$F18<>\"\",duomenys!F18,\"\")","v":""},{"$f":"IF(duomenys!$F18<>\"\",duomenys!G18,\"\")","v":""},{"$f":"IF(duomenys!$F18<>\"\",duomenys!H18,\"\")","v":""},{"$f":"IF(duomenys!$F18<>\"\",duomenys!I18,\"\")","v":""},{"$f":"IF(duomenys!$F18<>\"\",duomenys!J18,\"\")","v":""},{"$f":"IF(duomenys!$F18<>\"\",duomenys!K18,\"\")","v":""},{"$f":"IF(duomenys!$F18<>\"\",duomenys!L18,\"\")","v":""},{"$f":"IF(duomenys!$F18<>\"\",duomenys!M18,\"\")","v":""},{"$f":"IF(duomenys!$F18<>\"\",duomenys!N18,\"\")","v":""},{"$f":"IF(duomenys!$F18<>\"\",duomenys!O18,\"\")","v":""}]
[{"$f":"IF(duomenys!$F20<>\"\",duomenys!F20,\"\")","v":""},{"$f":"IF(duomenys!$F20<>\"\",duomenys!G20,\"\")","v":""},{"$f":"IF(duomenys!$F20<>\"\",duomenys!H20,\"\")","v":""},{"$f":"IF(duomenys!$F20<>\"\",duomenys!I20,\"\")","v":""},{"$f":"IF(duomenys!$F20<>\"\",duomenys!J20,\"\")","v":""},{"$f":"IF(duomenys!$F20<>\"\",duomenys!K20,\"\")","v":""},{"$f":"IF(duomenys!$F20<>\"\",duomenys!L20,\"\")","v":""},{"$f":"IF(duomenys!$F20<>\"\",duomenys!M20,\"\")","v":""},{"$f":"IF(duomenys!$F20<>\"\",duomenys!N20,\"\")","v":""},{"$f":"IF(duomenys!$F20<>\"\",duomenys!O20,\"\")","v":""}]
[{"$f":"IF(duomenys!$F22<>\"\",duomenys!F22,\"\")","v":""},{"$f":"IF(duomenys!$F22<>\"\",duomenys!G22,\"\")","v":""},{"$f":"IF(duomenys!$F22<>\"\",duomenys!H22,\"\")","v":""},{"$f":"IF(duomenys!$F22<>\"\",duomenys!I22,\"\")","v":""},{"$f":"IF(duomenys!$F22<>\"\",duomenys!J22,\"\")","v":""},{"$f":"IF(duomenys!$F22<>\"\",duomenys!K22,\"\")","v":""},{"$f":"IF(duomenys!$F22<>\"\",duomenys!L22,\"\")","v":""},{"$f":"IF(duomenys!$F22<>\"\",duomenys!M22,\"\")","v":""},{"$f":"IF(duomenys!$F22<>\"\",duomenys!N22,\"\")","v":""},{"$f":"IF(duomenys!$F22<>\"\",duomenys!O22,\"\")","v":""}]
[{"$f":"IF(duomenys!$F24<>\"\",duomenys!F24,\"\")","v":""},{"$f":"IF(duomenys!$F24<>\"\",duomenys!G24,\"\")","v":""},{"$f":"IF(duomenys!$F24<>\"\",duomenys!H24,\"\")","v":""},{"$f":"IF(duomenys!$F24<>\"\",duomenys!I24,\"\")","v":""},{"$f":"IF(duomenys!$F24<>\"\",duomenys!J24,\"\")","v":""},{"$f":"IF(duomenys!$F24<>\"\",duomenys!K24,\"\")","v":""},{"$f":"IF(duomenys!$F24<>\"\",duomenys!L24,\"\")","v":""},{"$f":"IF(duomenys!$F24<>\"\",duomenys!M24,\"\")","v":""},{"$f":"IF(duomenys!$F24<>\"\",duomenys!N24,\"\")","v":""},{"$f":"IF(duomenys!$F24<>\"\",duomenys!O24,\"\")","v":""}]
[{"$f":"IF(duomenys!$F26<>\"\",duomenys!F26,\"\")","v":""},{"$f":"IF(duomenys!$F26<>\"\",duomenys!G26,\"\")","v":""},{"$f":"IF(duomenys!$F26<>\"\",duomenys!H26,\"\")","v":""},{"$f":"IF(duomenys!$F26<>\"\",duomenys!I26,\"\")","v":""},{"$f":"IF(duomenys!$F26<>\"\",duomenys!J26,\"\")","v":""},{"$f":"IF(duomenys!$F26<>\"\",duomenys!K26,\"\")","v":""},{"$f":"IF(duomenys!$F26<>\"\",duomenys!L26,\"\")","v":""},{"$f":"IF(duomenys!$F26<>\"\",duomenys!M26,\"\")","v":""},{"$f":"IF(duomenys!$F26<>\"\",duomenys!N26,\"\")","v":""},{"$f":"IF(duomenys!$F26<>\"\",duomenys!O26,\"\")","v":""}]
[{"$f":"IF(duomenys!$F28<>\"\",duomenys!F28,\"\")","v":""},{"$f":"IF(duomenys!$F28<>\"\",duomenys!G28,\"\")","v":""},{"$f":"IF(duomenys!$F28<>\"\",duomenys!H28,\"\")","v":""},{"$f":"IF(duomenys!$F28<>\"\",duomenys!I28,\"\")","v":""},{"$f":"IF(duomenys!$F28<>\"\",duomenys!J28,\"\")","v":""},{"$f":"IF(duomenys!$F28<>\"\",duomenys!K28,\"\")","v":""},{"$f":"IF(duomenys!$F28<>\"\",duomenys!L28,\"\")","v":""},{"$f":"IF(duomenys!$F28<>\"\",duomenys!M28,\"\")","v":""},{"$f":"IF(duomenys!$F28<>\"\",duomenys!N28,\"\")","v":""},{"$f":"IF(duomenys!$F28<>\"\",duomenys!O28,\"\")","v":""}]
[{"$f":"IF(duomenys!$F30<>\"\",duomenys!F30,\"\")","v":""},{"$f":"IF(duomenys!$F30<>\"\",duomenys!G30,\"\")","v":""},{"$f":"IF(duomenys!$F30<>\"\",duomenys!H30,\"\")","v":""},{"$f":"IF(duomenys!$F30<>\"\",duomenys!I30,\"\")","v":""},{"$f":"IF(duomenys!$F30<>\"\",duomenys!J30,\"\")","v":""},{"$f":"IF(duomenys!$F30<>\"\",duomenys!K30,\"\")","v":""},{"$f":"IF(duomenys!$F30<>\"\",duomenys!L30,\"\")","v":""},{"$f":"IF(duomenys!$F30<>\"\",duomenys!M30,\"\")","v":""},{"$f":"IF(duomenys!$F30<>\"\",duomenys!N30,\"\")","v":""},{"$f":"IF(duomenys!$F30<>\"\",duomenys!O30,\"\")","v":""}]

{"sheet":"strings","index":11,"n_rows":28,"n_cols":2,"rows_kept":28,"cut":false,"hidden":true,"merged":[]}
["ID","StringLT"]
[2,"Atgal"]
[3,"Ieškoti"]
[4,"Kokybė (Kriterijus 1)"]
[5,"Ką keisti?"]
[6,"Įrašyta neleistina reikšmė. Leidžiami tik skaičiai. Įsitikinkite, kad naudojate tinkamą dešimtainio skaičiaus skyriklį."]
[7,"Nepavyko rasti bendro balo visoms kainos ir kokybės kombinacijoms. Patikrinkite kintamųjų reikšmes, kainai ir kokybei suteiktą svorį ir bendro balo paieškos programėlės nustatymus."]
[8,"Kokio bendro balo ieškoti?"]
[9,"Kryptis"]
[10,"Nustatymai"]
[11,"Pirmyn"]
[12,"Atgal"]
[13,"Nekeisti pirmo"]
[14,"Nekeisti paskutinio (10-o)"]
[15,"Geltona"]
[16,"Žalia"]
[17,"Mėlyna"]
[18,"Violetinė"]
[19,"Raudona"]
[20,"Išvalyti"]
[21,"Užpildyti 1 kokybės kriterijų"]
[22,"Skaičiavimas baigtas."]
[23,"Skaičiuojama..."]
[24,"Naudojama naujausia versija"]
[25,"Yra naujesnė versija:"]
[26,"Kompiuteriuose su OSX sistema, iliustracija atidaroma naujame lange"]
[27,"Spauskite čia"]
[28,"Simuliacija"]

{"sheet":"5","index":12,"n_rows":23,"n_cols":10,"rows_kept":23,"cut":false,"hidden":true,"merged":[]}
[{"$f":"IF(duomenys!F12<>\"\",duomenys!$A12*((duomenys!$E12-duomenys!F12)/(-1*(duomenys!$D12-duomenys!$E12))),\"\")","v":""},{"$f":"IF(duomenys!G12<>\"\",duomenys!$A12*((duomenys!$E12-duomenys!G12)/(-1*(duomenys!$D12-duomenys!$E12))),\"\")","v":""},{"$f":"IF(duomenys!H12<>\"\",duomenys!$A12*((duomenys!$E12-duomenys!H12)/(-1*(duomenys!$D12-duomenys!$E12))),\"\")","v":""},{"$f":"IF(duomenys!I12<>\"\",duomenys!$A12*((duomenys!$E12-duomenys!I12)/(-1*(duomenys!$D12-duomenys!$E12))),\"\")","v":""},{"$f":"IF(duomenys!J12<>\"\",duomenys!$A12*((duomenys!$E12-duomenys!J12)/(-1*(duomenys!$D12-duomenys!$E12))),\"\")","v":""},{"$f":"IF(duomenys!K12<>\"\",duomenys!$A12*((duomenys!$E12-duomenys!K12)/(-1*(duomenys!$D12-duomenys!$E12))),\"\")","v":""},{"$f":"IF(duomenys!L12<>\"\",duomenys!$A12*((duomenys!$E12-duomenys!L12)/(-1*(duomenys!$D12-duomenys!$E12))),\"\")","v":""},{"$f":"IF(duomenys!M12<>\"\",duomenys!$A12*((duomenys!$E12-duomenys!M12)/(-1*(duomenys!$D12-duomenys!$E12))),\"\")","v":""},{"$f":"IF(duomenys!N12<>\"\",duomenys!$A12*((duomenys!$E12-duomenys!N12)/(-1*(duomenys!$D12-duomenys!$E12))),\"\")","v":""},{"$f":"IF(duomenys!O12<>\"\",duomenys!$A12*((duomenys!$E12-duomenys!O12)/(-1*(duomenys!$D12-duomenys!$E12))),\"\")","v":""}]
[{"$f":"IF(duomenys!F14<>\"\",duomenys!$A14*((duomenys!$E14-duomenys!F14)/(-1*(duomenys!$D14-duomenys!$E14))),\"\")","v":""},{"$f":"IF(duomenys!G14<>\"\",duomenys!$A14*((duomenys!$E14-duomenys!G14)/(-1*(duomenys!$D14-duomenys!$E14))),\"\")","v":""},{"$f":"IF(duomenys!H14<>\"\",duomenys!$A14*((duomenys!$E14-duomenys!H14)/(-1*(duomenys!$D14-duomenys!$E14))),\"\")","v":""},{"$f":"IF(duomenys!I14<>\"\",duomenys!$A14*((duomenys!$E14-duomenys!I14)/(-1*(duomenys!$D14-duomenys!$E14))),\"\")","v":""},{"$f":"IF(duomenys!J14<>\"\",duomenys!$A14*((duomenys!$E14-duomenys!J14)/(-1*(duomenys!$D14-duomenys!$E14))),\"\")","v":""},{"$f":"IF(duomenys!K14<>\"\",duomenys!$A14*((duomenys!$E14-duomenys!K14)/(-1*(duomenys!$D14-duomenys!$E14))),\"\")","v":""},{"$f":"IF(duomenys!L14<>\"\",duomenys!$A14*((duomenys!$E14-duomenys!L14)/(-1*(duomenys!$D14-duomenys!$E14))),\"\")","v":""},{"$f":"IF(duomenys!M14<>\"\",duomenys!$A14*((duomenys!$E14-duomenys!M14)/(-1*(duomenys!$D14-duomenys!$E14))),\"\")","v":""},{"$f":"IF(duomenys!N14<>\"\",duomenys!$A14*((duomenys!$E14-duomenys!N14)/(-1*(duomenys!$D14-duomenys!$E14))),\"\")","v":""},{"$f":"IF(duomenys!O14<>\"\",duomenys!$A14*((duomenys!$E14-duomenys!O14)/(-1*(duomenys!$D14-duomenys!$E14))),\"\")","v":""}]
[{"$f":"IF(duomenys!F16<>\"\",duomenys!$A16*((duomenys!$E16-duomenys!F16)/(-1*(duomenys!$D16-duomenys!$E16))),\"\")","v":""},{"$f":"IF(duomenys!G16<>\"\",duomenys!$A16*((duomenys!$E16-duomenys!G16)/(-1*(duomenys!$D16-duomenys!$E16))),\"\")","v":""},{"$f":"IF(duomenys!H16<>\"\",duomenys!$A16*((duomenys!$E16-duomenys!H16)/(-1*(duomenys!$D16-duomenys!$E16))),\"\")","v":""},{"$f":"IF(duomenys!I16<>\"\",duomenys!$A16*((duomenys!$E16-duomenys!I16)/(-1*(duomenys!$D16-duomenys!$E16))),\"\")","v":""},{"$f":"IF(duomenys!J16<>\"\",duomenys!$A16*((duomenys!$E16-duomenys!J16)/(-1*(duomenys!$D16-duomenys!$E16))),\"\")","v":""},{"$f":"IF(duomenys!K16<>\"\",duomenys!$A16*((duomenys!$E16-duomenys!K16)/(-1*(duomenys!$D16-duomenys!$E16))),\"\")","v":""},{"$f":"IF(duomenys!L16<>\"\",duomenys!$A16*((duomenys!$E16-duomenys!L16)/(-1*(duomenys!$D16-duomenys!$E16))),\"\")","v":""},{"$f":"IF(duomenys!M16<>\"\",duomenys!$A16*((duomenys!$E16-duomenys!M16)/(-1*(duomenys!$D16-duomenys!$E16))),\"\")","v":""},{"$f":"IF(duomenys!N16<>\"\",duomenys!$A16*((duomenys!$E16-duomenys!N16)/(-1*(duomenys!$D16-duomenys!$E16))),\"\")","v":""},{"$f":"IF(duomenys!O16<>\"\",duomenys!$A16*((duomenys!$E16-duomenys!O16)/(-1*(duomenys!$D16-duomenys!$E16))),\"\")","v":""}]
[{"$f":"IF(duomenys!F18<>\"\",duomenys!$A18*((duomenys!$E18-duomenys!F18)/(-1*(duomenys!$D18-duomenys!$E18))),\"\")","v":""},{"$f":"IF(duomenys!G18<>\"\",duomenys!$A18*((duomenys!$E18-duomenys!G18)/(-1*(duomenys!$D18-duomenys!$E18))),\"\")","v":""},{"$f":"IF(duomenys!H18<>\"\",duomenys!$A18*((duomenys!$E18-duomenys!H18)/(-1*(duomenys!$D18-duomenys!$E18))),\"\")","v":""},{"$f":"IF(duomenys!I18<>\"\",duomenys!$A18*((duomenys!$E18-duomenys!I18)/(-1*(duomenys!$D18-duomenys!$E18))),\"\")","v":""},{"$f":"IF(duomenys!J18<>\"\",duomenys!$A18*((duomenys!$E18-duomenys!J18)/(-1*(duomenys!$D18-duomenys!$E18))),\"\")","v":""},{"$f":"IF(duomenys!K18<>\"\",duomenys!$A18*((duomenys!$E18-duomenys!K18)/(-1*(duomenys!$D18-duomenys!$E18))),\"\")","v":""},{"$f":"IF(duomenys!L18<>\"\",duomenys!$A18*((duomenys!$E18-duomenys!L18)/(-1*(duomenys!$D18-duomenys!$E18))),\"\")","v":""},{"$f":"IF(duomenys!M18<>\"\",duomenys!$A18*((duomenys!$E18-duomenys!M18)/(-1*(duomenys!$D18-duomenys!$E18))),\"\")","v":""},{"$f":"IF(duomenys!N18<>\"\",duomenys!$A18*((duomenys!$E18-duomenys!N18)/(-1*(duomenys!$D18-duomenys!$E18))),\"\")","v":""},{"$f":"IF(duomenys!O18<>\"\",duomenys!$A18*((duomenys!$E18-duomenys!O18)/(-1*(duomenys!$D18-duomenys!$E18))),\"\")","v":""}]
[{"$f":"IF(duomenys!F20<>\"\",duomenys!$A20*((duomenys!$E20-duomenys!F20)/(-1*(duomenys!$D20-duomenys!$E20))),\"\")","v":""},{"$f":"IF(duomenys!G20<>\"\",duomenys!$A20*((duomenys!$E20-duomenys!G20)/(-1*(duomenys!$D20-duomenys!$E20))),\"\")","v":""},{"$f":"IF(duomenys!H20<>\"\",duomenys!$A20*((duomenys!$E20-duomenys!H20)/(-1*(duomenys!$D20-duomenys!$E20))),\"\")","v":""},{"$f":"IF(duomenys!I20<>\"\",duomenys!$A20*((duomenys!$E20-duomenys!I20)/(-1*(duomenys!$D20-duomenys!$E20))),\"\")","v":""},{"$f":"IF(duomenys!J20<>\"\",duomenys!$A20*((duomenys!$E20-duomenys!J20)/(-1*(duomenys!$D20-duomenys!$E20))),\"\")","v":""},{"$f":"IF(duomenys!K20<>\"\",duomenys!$A20*((duomenys!$E20-duomenys!K20)/(-1*(duomenys!$D20-duomenys!$E20))),\"\")","v":""},{"$f":"IF(duomenys!L20<>\"\",duomenys!$A20*((duomenys!$E20-duomenys!L20)/(-1*(duomenys!$D20-duomenys!$E20))),\"\")","v":""},{"$f":"IF(duomenys!M20<>\"\",duomenys!$A20*((duomenys!$E20-duomenys!M20)/(-1*(duomenys!$D20-duomenys!$E20))),\"\")","v":""},{"$f":"IF(duomenys!N20<>\"\",duomenys!$A20*((duomenys!$E20-duomenys!N20)/(-1*(duomenys!$D20-duomenys!$E20))),\"\")","v":""},{"$f":"IF(duomenys!O20<>\"\",duomenys!$A20*((duomenys!$E20-duomenys!O20)/(-1*(duomenys!$D20-duomenys!$E20))),\"\")","v":""}]
[{"$f":"IF(duomenys!F22<>\"\",duomenys!$A22*((duomenys!$E22-duomenys!F22)/(-1*(duomenys!$D22-duomenys!$E22))),\"\")","v":""},{"$f":"IF(duomenys!G22<>\"\",duomenys!$A22*((duomenys!$E22-duomenys!G22)/(-1*(duomenys!$D22-duomenys!$E22))),\"\")","v":""},{"$f":"IF(duomenys!H22<>\"\",duomenys!$A22*((duomenys!$E22-duomenys!H22)/(-1*(duomenys!$D22-duomenys!$E22))),\"\")","v":""},{"$f":"IF(duomenys!I22<>\"\",duomenys!$A22*((duomenys!$E22-duomenys!I22)/(-1*(duomenys!$D22-duomenys!$E22))),\"\")","v":""},{"$f":"IF(duomenys!J22<>\"\",duomenys!$A22*((duomenys!$E22-duomenys!J22)/(-1*(duomenys!$D22-duomenys!$E22))),\"\")","v":""},{"$f":"IF(duomenys!K22<>\"\",duomenys!$A22*((duomenys!$E22-duomenys!K22)/(-1*(duomenys!$D22-duomenys!$E22))),\"\")","v":""},{"$f":"IF(duomenys!L22<>\"\",duomenys!$A22*((duomenys!$E22-duomenys!L22)/(-1*(duomenys!$D22-duomenys!$E22))),\"\")","v":""},{"$f":"IF(duomenys!M22<>\"\",duomenys!$A22*((duomenys!$E22-duomenys!M22)/(-1*(duomenys!$D22-duomenys!$E22))),\"\")","v":""},{"$f":"IF(duomenys!N22<>\"\",duomenys!$A22*((duomenys!$E22-duomenys!N22)/(-1*(duomenys!$D22-duomenys!$E22))),\"\")","v":""},{"$f":"IF(duomenys!O22<>\"\",duomenys!$A22*((duomenys!$E22-duomenys!O22)/(-1*(duomenys!$D22-duomenys!$E22))),\"\")","v":""}]
[{"$f":"IF(duomenys!F24<>\"\",duomenys!$A24*((duomenys!$E24-duomenys!F24)/(-1*(duomenys!$D24-duomenys!$E24))),\"\")","v":""},{"$f":"IF(duomenys!G24<>\"\",duomenys!$A24*((duomenys!$E24-duomenys!G24)/(-1*(duomenys!$D24-duomenys!$E24))),\"\")","v":""},{"$f":"IF(duomenys!H24<>\"\",duomenys!$A24*((duomenys!$E24-duomenys!H24)/(-1*(duomenys!$D24-duomenys!$E24))),\"\")","v":""},{"$f":"IF(duomenys!I24<>\"\",duomenys!$A24*((duomenys!$E24-duomenys!I24)/(-1*(duomenys!$D24-duomenys!$E24))),\"\")","v":""},{"$f":"IF(duomenys!J24<>\"\",duomenys!$A24*((duomenys!$E24-duomenys!J24)/(-1*(duomenys!$D24-duomenys!$E24))),\"\")","v":""},{"$f":"IF(duomenys!K24<>\"\",duomenys!$A24*((duomenys!$E24-duomenys!K24)/(-1*(duomenys!$D24-duomenys!$E24))),\"\")","v":""},{"$f":"IF(duomenys!L24<>\"\",duomenys!$A24*((duomenys!$E24-duomenys!L24)/(-1*(duomenys!$D24-duomenys!$E24))),\"\")","v":""},{"$f":"IF(duomenys!M24<>\"\",duomenys!$A24*((duomenys!$E24-duomenys!M24)/(-1*(duomenys!$D24-duomenys!$E24))),\"\")","v":""},{"$f":"IF(duomenys!N24<>\"\",duomenys!$A24*((duomenys!$E24-duomenys!N24)/(-1*(duomenys!$D24-duomenys!$E24))),\"\")","v":""},{"$f":"IF(duomenys!O24<>\"\",duomenys!$A24*((duomenys!$E24-duomenys!O24)/(-1*(duomenys!$D24-duomenys!$E24))),\"\")","v":""}]
[{"$f":"IF(duomenys!F26<>\"\",duomenys!$A26*((duomenys!$E26-duomenys!F26)/(-1*(duomenys!$D26-duomenys!$E26))),\"\")","v":""},{"$f":"IF(duomenys!G26<>\"\",duomenys!$A26*((duomenys!$E26-duomenys!G26)/(-1*(duomenys!$D26-duomenys!$E26))),\"\")","v":""},{"$f":"IF(duomenys!H26<>\"\",duomenys!$A26*((duomenys!$E26-duomenys!H26)/(-1*(duomenys!$D26-duomenys!$E26))),\"\")","v":""},{"$f":"IF(duomenys!I26<>\"\",duomenys!$A26*((duomenys!$E26-duomenys!I26)/(-1*(duomenys!$D26-duomenys!$E26))),\"\")","v":""},{"$f":"IF(duomenys!J26<>\"\",duomenys!$A26*((duomenys!$E26-duomenys!J26)/(-1*(duomenys!$D26-duomenys!$E26))),\"\")","v":""},{"$f":"IF(duomenys!K26<>\"\",duomenys!$A26*((duomenys!$E26-duomenys!K26)/(-1*(duomenys!$D26-duomenys!$E26))),\"\")","v":""},{"$f":"IF(duomenys!L26<>\"\",duomenys!$A26*((duomenys!$E26-duomenys!L26)/(-1*(duomenys!$D26-duomenys!$E26))),\"\")","v":""},{"$f":"IF(duomenys!M26<>\"\",duomenys!$A26*((duomenys!$E26-duomenys!M26)/(-1*(duomenys!$D26-duomenys!$E26))),\"\")","v":""},{"$f":"IF(duomenys!N26<>\"\",duomenys!$A26*((duomenys!$E26-duomenys!N26)/(-1*(duomenys!$D26-duomenys!$E26))),\"\")","v":""},{"$f":"IF(duomenys!O26<>\"\",duomenys!$A26*((duomenys!$E26-duomenys!O26)/(-1*(duomenys!$D26-duomenys!$E26))),\"\")","v":""}]
[{"$f":"IF(duomenys!F28<>\"\",duomenys!$A28*((duomenys!$E28-duomenys!F28)/(-1*(duomenys!$D28-duomenys!$E28))),\"\")","v":""},{"$f":"IF(duomenys!G28<>\"\",duomenys!$A28*((duomenys!$E28-duomenys!G28)/(-1*(duomenys!$D28-duomenys!$E28))),\"\")","v":""},{"$f":"IF(duomenys!H28<>\"\",duomenys!$A28*((duomenys!$E28-duomenys!H28)/(-1*(duomenys!$D28-duomenys!$E28))),\"\")","v":""},{"$f":"IF(duomenys!I28<>\"\",duomenys!$A28*((duomenys!$E28-duomenys!I28)/(-1*(duomenys!$D28-duomenys!$E28))),\"\")","v":""},{"$f":"IF(duomenys!J28<>\"\",duomenys!$A28*((duomenys!$E28-duomenys!J28)/(-1*(duomenys!$D28-duomenys!$E28))),\"\")","v":""},{"$f":"IF(duomenys!K28<>\"\",duomenys!$A28*((duomenys!$E28-duomenys!K28)/(-1*(duomenys!$D28-duomenys!$E28))),\"\")","v":""},{"$f":"IF(duomenys!L28<>\"\",duomenys!$A28*((duomenys!$E28-duomenys!L28)/(-1*(duomenys!$D28-duomenys!$E28))),\"\")","v":""},{"$f":"IF(duomenys!M28<>\"\",duomenys!$A28*((duomenys!$E28-duomenys!M28)/(-1*(duomenys!$D28-duomenys!$E28))),\"\")","v":""},{"$f":"IF(duomenys!N28<>\"\",duomenys!$A28*((duomenys!$E28-duomenys!N28)/(-1*(duomenys!$D28-duomenys!$E28))),\"\")","v":""},{"$f":"IF(duomenys!O28<>\"\",duomenys!$A28*((duomenys!$E28-duomenys!O28)/(-1*(duomenys!$D28-duomenys!$E28))),\"\")","v":""}]
[{"$f":"IF(duomenys!F30<>\"\",duomenys!$A30*((duomenys!$E30-duomenys!F30)/(-1*(duomenys!$D30-duomenys!$E30))),\"\")","v":""},{"$f":"IF(duomenys!G30<>\"\",duomenys!$A30*((duomenys!$E30-duomenys!G30)/(-1*(duomenys!$D30-duomenys!$E30))),\"\")","v":""},{"$f":"IF(duomenys!H30<>\"\",duomenys!$A30*((duomenys!$E30-duomenys!H30)/(-1*(duomenys!$D30-duomenys!$E30))),\"\")","v":""},{"$f":"IF(duomenys!I30<>\"\",duomenys!$A30*((duomenys!$E30-duomenys!I30)/(-1*(duomenys!$D30-duomenys!$E30))),\"\")","v":""},{"$f":"IF(duomenys!J30<>\"\",duomenys!$A30*((duomenys!$E30-duomenys!J30)/(-1*(duomenys!$D30-duomenys!$E30))),\"\")","v":""},{"$f":"IF(duomenys!K30<>\"\",duomenys!$A30*((duomenys!$E30-duomenys!K30)/(-1*(duomenys!$D30-duomenys!$E30))),\"\")","v":""},{"$f":"IF(duomenys!L30<>\"\",duomenys!$A30*((duomenys!$E30-duomenys!L30)/(-1*(duomenys!$D30-duomenys!$E30))),\"\")","v":""},{"$f":"IF(duomenys!M30<>\"\",duomenys!$A30*((duomenys!$E30-duomenys!M30)/(-1*(duomenys!$D30-duomenys!$E30))),\"\")","v":""},{"$f":"IF(duomenys!N30<>\"\",duomenys!$A30*((duomenys!$E30-duomenys!N30)/(-1*(duomenys!$D30-duomenys!$E30))),\"\")","v":""},{"$f":"IF(duomenys!O30<>\"\",duomenys!$A30*((duomenys!$E30-duomenys!O30)/(-1*(duomenys!$D30-duomenys!$E30))),\"\")","v":""}]
[{"$f":"IF(duomenys!F23<>\"\",duomenys!$A23*((duomenys!$E23-duomenys!F23)/(-1*(duomenys!$D23-duomenys!$E23))),\"\")","v":""},{"$f":"IF(duomenys!G23<>\"\",duomenys!$A23*((duomenys!$E23-duomenys!G23)/(-1*(duomenys!$D23-duomenys!$E23))),\"\")","v":""},{"$f":"IF(duomenys!H23<>\"\",duomenys!$A23*((duomenys!$E23-duomenys!H23)/(-1*(duomenys!$D23-duomenys!$E23))),\"\")","v":""},{"$f":"IF(duomenys!I23<>\"\",duomenys!$A23*((duomenys!$E23-duomenys!I23)/(-1*(duomenys!$D23-duomenys!$E23))),\"\")","v":""},{"$f":"IF(duomenys!J23<>\"\",duomenys!$A23*((duomenys!$E23-duomenys!J23)/(-1*(duomenys!$D23-duomenys!$E23))),\"\")","v":""},{"$f":"IF(duomenys!K23<>\"\",duomenys!$A23*((duomenys!$E23-duomenys!K23)/(-1*(duomenys!$D23-duomenys!$E23))),\"\")","v":""},{"$f":"IF(duomenys!L23<>\"\",duomenys!$A23*((duomenys!$E23-duomenys!L23)/(-1*(duomenys!$D23-duomenys!$E23))),\"\")","v":""},{"$f":"IF(duomenys!M23<>\"\",duomenys!$A23*((duomenys!$E23-duomenys!M23)/(-1*(duomenys!$D23-duomenys!$E23))),\"\")","v":""},{"$f":"IF(duomenys!N23<>\"\",duomenys!$A23*((duomenys!$E23-duomenys!N23)/(-1*(duomenys!$D23-duomenys!$E23))),\"\")","v":""},{"$f":"IF(duomenys!O23<>\"\",duomenys!$A23*((duomenys!$E23-duomenys!O23)/(-1*(duomenys!$D23-duomenys!$E23))),\"\")","v":""}]
[]
[]
[]
[]
[]
[]
[]
[]
[{"$f":"IF(duomenys!F32<>\"\",duomenys!$A32*((duomenys!$E32-duomenys!F32)/(-1*(duomenys!$D32-duomenys!$E32))),\"\")","v":""},{"$f":"IF(duomenys!G32<>\"\",duomenys!$A32*((duomenys!$E32-duomenys!G32)/(-1*(duomenys!$D32-duomenys!$E32))),\"\")","v":""},{"$f":"IF(duomenys!H32<>\"\",duomenys!$A32*((duomenys!$E32-duomenys!H32)/(-1*(duomenys!$D32-duomenys!$E32))),\"\")","v":""},{"$f":"IF(duomenys!I32<>\"\",duomenys!$A32*((duomenys!$E32-duomenys!I32)/(-1*(duomenys!$D32-duomenys!$E32))),\"\")","v":""},{"$f":"IF(duomenys!J32<>\"\",duomenys!$A32*((duomenys!$E32-duomenys!J32)/(-1*(duomenys!$D32-duomenys!$E32))),\"\")","v":""},{"$f":"IF(duomenys!K32<>\"\",duomenys!$A32*((duomenys!$E32-duomenys!K32)/(-1*(duomenys!$D32-duomenys!$E32))),\"\")","v":""},{"$f":"IF(duomenys!L32<>\"\",duomenys!$A32*((duomenys!$E32-duomenys!L32)/(-1*(duomenys!$D32-duomenys!$E32))),\"\")","v":""},{"$f":"IF(duomenys!M32<>\"\",duomenys!$A32*((duomenys!$E32-duomenys!M32)/(-1*(duomenys!$D32-duomenys!$E32))),\"\")","v":""},{"$f":"IF(duomenys!N32<>\"\",duomenys!$A32*((duomenys!$E32-duomenys!N32)/(-1*(duomenys!$D32-duomenys!$E32))),\"\")","v":""},{"$f":"IF(duomenys!O32<>\"\",duomenys!$A32*((duomenys!$E32-duomenys!O32)/(-1*(duomenys!$D32-duomenys!$E32))),\"\")","v":""}]
[{"$f":"IF(duomenys!F33<>\"\",duomenys!$A33*((duomenys!$E33-duomenys!F33)/(-1*(duomenys!$D33-duomenys!$E33))),\"\")","v":""},{"$f":"IF(duomenys!G33<>\"\",duomenys!$A33*((duomenys!$E33-duomenys!G33)/(-1*(duomenys!$D33-duomenys!$E33))),\"\")","v":""},{"$f":"IF(duomenys!H33<>\"\",duomenys!$A33*((duomenys!$E33-duomenys!H33)/(-1*(duomenys!$D33-duomenys!$E33))),\"\")","v":""},{"$f":"IF(duomenys!I33<>\"\",duomenys!$A33*((duomenys!$E33-duomenys!I33)/(-1*(duomenys!$D33-duomenys!$E33))),\"\")","v":""},{"$f":"IF(duomenys!J33<>\"\",duomenys!$A33*((duomenys!$E33-duomenys!J33)/(-1*(duomenys!$D33-duomenys!$E33))),\"\")","v":""},{"$f":"IF(duomenys!K33<>\"\",duomenys!$A33*((duomenys!$E33-duomenys!K33)/(-1*(duomenys!$D33-duomenys!$E33))),\"\")","v":""},{"$f":"IF(duomenys!L33<>\"\",duomenys!$A33*((duomenys!$E33-duomenys!L33)/(-1*(duomenys!$D33-duomenys!$E33))),\"\")","v":""},{"$f":"IF(duomenys!M33<>\"\",duomenys!$A33*((duomenys!$E33-duomenys!M33)/(-1*(duomenys!$D33-duomenys!$E33))),\"\")","v":""},{"$f":"IF(duomenys!N33<>\"\",duomenys!$A33*((duomenys!$E33-duomenys!N33)/(-1*(duomenys!$D33-duomenys!$E33))),\"\")","v":""},{"$f":"IF(duomenys!O33<>\"\",duomenys!$A33*((duomenys!$E33-duomenys!O33)/(-1*(duomenys!$D33-duomenys!$E33))),\"\")","v":""}]
[{"$f":"IF(duomenys!F34<>\"\",formules!$A72*((duomenys!$E34-duomenys!F34)/(-1*(duomenys!$D34-duomenys!$E34))),\"\")","v":""},{"$f":"IF(duomenys!G34<>\"\",formules!$A72*((duomenys!$E34-duomenys!G34)/(-1*(duomenys!$D34-duomenys!$E34))),\"\")","v":""},{"$f":"IF(duomenys!H34<>\"\",formules!$A72*((duomenys!$E34-duomenys!H34)/(-1*(duomenys!$D34-duomenys!$E34))),\"\")","v":""},{"$f":"IF(duomenys!I34<>\"\",formules!$A72*((duomenys!$E34-duomenys!I34)/(-1*(duomenys!$D34-duomenys!$E34))),\"\")","v":""},{"$f":"IF(duomenys!J34<>\"\",formules!$A72*((duomenys!$E34-duomenys!J34)/(-1*(duomenys!$D34-duomenys!$E34))),\"\")","v":""},{"$f":"IF(duomenys!K34<>\"\",formules!$A72*((duomenys!$E34-duomenys!K34)/(-1*(duomenys!$D34-duomenys!$E34))),\"\")","v":""},{"$f":"IF(duomenys!L34<>\"\",formules!$A72*((duomenys!$E34-duomenys!L34)/(-1*(duomenys!$D34-duomenys!$E34))),\"\")","v":""},{"$f":"IF(duomenys!M34<>\"\",formules!$A72*((duomenys!$E34-duomenys!M34)/(-1*(duomenys!$D34-duomenys!$E34))),\"\")","v":""},{"$f":"IF(duomenys!N34<>\"\",formules!$A72*((duomenys!$E34-duomenys!N34)/(-1*(duomenys!$D34-duomenys!$E34))),\"\")","v":""},{"$f":"IF(duomenys!O34<>\"\",formules!$A72*((duomenys!$E34-duomenys!O34)/(-1*(duomenys!$D34-duomenys!$E34))),\"\")","v":""}]
[{"$f":"IF(duomenys!F35<>\"\",duomenys!$A35*((duomenys!$E35-duomenys!F35)/(-1*(duomenys!$D35-duomenys!$E35))),\"\")","v":""},{"$f":"IF(duomenys!G35<>\"\",duomenys!$A35*((duomenys!$E35-duomenys!G35)/(-1*(duomenys!$D35-duomenys!$E35))),\"\")","v":""},{"$f":"IF(duomenys!H35<>\"\",duomenys!$A35*((duomenys!$E35-duomenys!H35)/(-1*(duomenys!$D35-duomenys!$E35))),\"\")","v":""},{"$f":"IF(duomenys!I35<>\"\",duomenys!$A35*((duomenys!$E35-duomenys!I35)/(-1*(duomenys!$D35-duomenys!$E35))),\"\")","v":""},{"$f":"IF(duomenys!J35<>\"\",duomenys!$A35*((duomenys!$E35-duomenys!J35)/(-1*(duomenys!$D35-duomenys!$E35))),\"\")","v":""},{"$f":"IF(duomenys!K35<>\"\",duomenys!$A35*((duomenys!$E35-duomenys!K35)/(-1*(duomenys!$D35-duomenys!$E35))),\"\")","v":""},{"$f":"IF(duomenys!L35<>\"\",duomenys!$A35*((duomenys!$E35-duomenys!L35)/(-1*(duomenys!$D35-duomenys!$E35))),\"\")","v":""},{"$f":"IF(duomenys!M35<>\"\",duomenys!$A35*((duomenys!$E35-duomenys!M35)/(-1*(duomenys!$D35-duomenys!$E35))),\"\")","v":""},{"$f":"IF(duomenys!N35<>\"\",duomenys!$A35*((duomenys!$E35-duomenys!N35)/(-1*(duomenys!$D35-duomenys!$E35))),\"\")","v":""},{"$f":"IF(duomenys!O35<>\"\",duomenys!$A35*((duomenys!$E35-duomenys!O35)/(-1*(duomenys!$D35-duomenys!$E35))),\"\")","v":""}]

{"sheet":"6","index":13,"n_rows":10,"n_cols":10,"rows_kept":10,"cut":false,"hidden":true,"merged":[]}
[{"$f":"IF(duomenys!$F12<>\"\",duomenys!$A12*(1-(duomenys!$E12-duomenys!F12)/(duomenys!$E12-duomenys!$D12)),\"\")","v":""},{"$f":"IF(duomenys!$F12<>\"\",duomenys!$A12*(1-(duomenys!$E12-duomenys!G12)/(duomenys!$E12-duomenys!$D12)),\"\")","v":""},{"$f":"IF(duomenys!$F12<>\"\",duomenys!$A12*(1-(duomenys!$E12-duomenys!H12)/(duomenys!$E12-duomenys!$D12)),\"\")","v":""},{"$f":"IF(duomenys!$F12<>\"\",duomenys!$A12*(1-(duomenys!$E12-duomenys!I12)/(duomenys!$E12-duomenys!$D12)),\"\")","v":""},{"$f":"IF(duomenys!$F12<>\"\",duomenys!$A12*(1-(duomenys!$E12-duomenys!J12)/(duomenys!$E12-duomenys!$D12)),\"\")","v":""},{"$f":"IF(duomenys!$F12<>\"\",duomenys!$A12*(1-(duomenys!$E12-duomenys!K12)/(duomenys!$E12-duomenys!$D12)),\"\")","v":""},{"$f":"IF(duomenys!$F12<>\"\",duomenys!$A12*(1-(duomenys!$E12-duomenys!L12)/(duomenys!$E12-duomenys!$D12)),\"\")","v":""},{"$f":"IF(duomenys!$F12<>\"\",duomenys!$A12*(1-(duomenys!$E12-duomenys!M12)/(duomenys!$E12-duomenys!$D12)),\"\")","v":""},{"$f":"IF(duomenys!$F12<>\"\",duomenys!$A12*(1-(duomenys!$E12-duomenys!N12)/(duomenys!$E12-duomenys!$D12)),\"\")","v":""},{"$f":"IF(duomenys!$F12<>\"\",duomenys!$A12*(1-(duomenys!$E12-duomenys!O12)/(duomenys!$E12-duomenys!$D12)),\"\")","v":""}]
[{"$f":"IF(duomenys!$F14<>\"\",duomenys!$A14*(1-(duomenys!$E14-duomenys!F14)/(duomenys!$E14-duomenys!$D14)),\"\")","v":""},{"$f":"IF(duomenys!$F14<>\"\",duomenys!$A14*(1-(duomenys!$E14-duomenys!G14)/(duomenys!$E14-duomenys!$D14)),\"\")","v":""},{"$f":"IF(duomenys!$F14<>\"\",duomenys!$A14*(1-(duomenys!$E14-duomenys!H14)/(duomenys!$E14-duomenys!$D14)),\"\")","v":""},{"$f":"IF(duomenys!$F14<>\"\",duomenys!$A14*(1-(duomenys!$E14-duomenys!I14)/(duomenys!$E14-duomenys!$D14)),\"\")","v":""},{"$f":"IF(duomenys!$F14<>\"\",duomenys!$A14*(1-(duomenys!$E14-duomenys!J14)/(duomenys!$E14-duomenys!$D14)),\"\")","v":""},{"$f":"IF(duomenys!$F14<>\"\",duomenys!$A14*(1-(duomenys!$E14-duomenys!K14)/(duomenys!$E14-duomenys!$D14)),\"\")","v":""},{"$f":"IF(duomenys!$F14<>\"\",duomenys!$A14*(1-(duomenys!$E14-duomenys!L14)/(duomenys!$E14-duomenys!$D14)),\"\")","v":""},{"$f":"IF(duomenys!$F14<>\"\",duomenys!$A14*(1-(duomenys!$E14-duomenys!M14)/(duomenys!$E14-duomenys!$D14)),\"\")","v":""},{"$f":"IF(duomenys!$F14<>\"\",duomenys!$A14*(1-(duomenys!$E14-duomenys!N14)/(duomenys!$E14-duomenys!$D14)),\"\")","v":""},{"$f":"IF(duomenys!$F14<>\"\",duomenys!$A14*(1-(duomenys!$E14-duomenys!O14)/(duomenys!$E14-duomenys!$D14)),\"\")","v":""}]
[{"$f":"IF(duomenys!$F16<>\"\",duomenys!$A16*(1-(duomenys!$E16-duomenys!F16)/(duomenys!$E16-duomenys!$D16)),\"\")","v":""},{"$f":"IF(duomenys!$F16<>\"\",duomenys!$A16*(1-(duomenys!$E16-duomenys!G16)/(duomenys!$E16-duomenys!$D16)),\"\")","v":""},{"$f":"IF(duomenys!$F16<>\"\",duomenys!$A16*(1-(duomenys!$E16-duomenys!H16)/(duomenys!$E16-duomenys!$D16)),\"\")","v":""},{"$f":"IF(duomenys!$F16<>\"\",duomenys!$A16*(1-(duomenys!$E16-duomenys!I16)/(duomenys!$E16-duomenys!$D16)),\"\")","v":""},{"$f":"IF(duomenys!$F16<>\"\",duomenys!$A16*(1-(duomenys!$E16-duomenys!J16)/(duomenys!$E16-duomenys!$D16)),\"\")","v":""},{"$f":"IF(duomenys!$F16<>\"\",duomenys!$A16*(1-(duomenys!$E16-duomenys!K16)/(duomenys!$E16-duomenys!$D16)),\"\")","v":""},{"$f":"IF(duomenys!$F16<>\"\",duomenys!$A16*(1-(duomenys!$E16-duomenys!L16)/(duomenys!$E16-duomenys!$D16)),\"\")","v":""},{"$f":"IF(duomenys!$F16<>\"\",duomenys!$A16*(1-(duomenys!$E16-duomenys!M16)/(duomenys!$E16-duomenys!$D16)),\"\")","v":""},{"$f":"IF(duomenys!$F16<>\"\",duomenys!$A16*(1-(duomenys!$E16-duomenys!N16)/(duomenys!$E16-duomenys!$D16)),\"\")","v":""},{"$f":"IF(duomenys!$F16<>\"\",duomenys!$A16*(1-(duomenys!$E16-duomenys!O16)/(duomenys!$E16-duomenys!$D16)),\"\")","v":""}]
[{"$f":"IF(duomenys!$F18<>\"\",duomenys!$A18*(1-(duomenys!$E18-duomenys!F18)/(duomenys!$E18-duomenys!$D18)),\"\")","v":""},{"$f":"IF(duomenys!$F18<>\"\",duomenys!$A18*(1-(duomenys!$E18-duomenys!G18)/(duomenys!$E18-duomenys!$D18)),\"\")","v":""},{"$f":"IF(duomenys!$F18<>\"\",duomenys!$A18*(1-(duomenys!$E18-duomenys!H18)/(duomenys!$E18-duomenys!$D18)),\"\")","v":""},{"$f":"IF(duomenys!$F18<>\"\",duomenys!$A18*(1-(duomenys!$E18-duomenys!I18)/(duomenys!$E18-duomenys!$D18)),\"\")","v":""},{"$f":"IF(duomenys!$F18<>\"\",duomenys!$A18*(1-(duomenys!$E18-duomenys!J18)/(duomenys!$E18-duomenys!$D18)),\"\")","v":""},{"$f":"IF(duomenys!$F18<>\"\",duomenys!$A18*(1-(duomenys!$E18-duomenys!K18)/(duomenys!$E18-duomenys!$D18)),\"\")","v":""},{"$f":"IF(duomenys!$F18<>\"\",duomenys!$A18*(1-(duomenys!$E18-duomenys!L18)/(duomenys!$E18-duomenys!$D18)),\"\")","v":""},{"$f":"IF(duomenys!$F18<>\"\",duomenys!$A18*(1-(duomenys!$E18-duomenys!M18)/(duomenys!$E18-duomenys!$D18)),\"\")","v":""},{"$f":"IF(duomenys!$F18<>\"\",duomenys!$A18*(1-(duomenys!$E18-duomenys!N18)/(duomenys!$E18-duomenys!$D18)),\"\")","v":""},{"$f":"IF(duomenys!$F18<>\"\",duomenys!$A18*(1-(duomenys!$E18-duomenys!O18)/(duomenys!$E18-duomenys!$D18)),\"\")","v":""}]
[{"$f":"IF(duomenys!$F20<>\"\",duomenys!$A20*(1-(duomenys!$E20-duomenys!F20)/(duomenys!$E20-duomenys!$D20)),\"\")","v":""},{"$f":"IF(duomenys!$F20<>\"\",duomenys!$A20*(1-(duomenys!$E20-duomenys!G20)/(duomenys!$E20-duomenys!$D20)),\"\")","v":""},{"$f":"IF(duomenys!$F20<>\"\",duomenys!$A20*(1-(duomenys!$E20-duomenys!H20)/(duomenys!$E20-duomenys!$D20)),\"\")","v":""},{"$f":"IF(duomenys!$F20<>\"\",duomenys!$A20*(1-(duomenys!$E20-duomenys!I20)/(duomenys!$E20-duomenys!$D20)),\"\")","v":""},{"$f":"IF(duomenys!$F20<>\"\",duomenys!$A20*(1-(duomenys!$E20-duomenys!J20)/(duomenys!$E20-duomenys!$D20)),\"\")","v":""},{"$f":"IF(duomenys!$F20<>\"\",duomenys!$A20*(1-(duomenys!$E20-duomenys!K20)/(duomenys!$E20-duomenys!$D20)),\"\")","v":""},{"$f":"IF(duomenys!$F20<>\"\",duomenys!$A20*(1-(duomenys!$E20-duomenys!L20)/(duomenys!$E20-duomenys!$D20)),\"\")","v":""},{"$f":"IF(duomenys!$F20<>\"\",duomenys!$A20*(1-(duomenys!$E20-duomenys!M20)/(duomenys!$E20-duomenys!$D20)),\"\")","v":""},{"$f":"IF(duomenys!$F20<>\"\",duomenys!$A20*(1-(duomenys!$E20-duomenys!N20)/(duomenys!$E20-duomenys!$D20)),\"\")","v":""},{"$f":"IF(duomenys!$F20<>\"\",duomenys!$A20*(1-(duomenys!$E20-duomenys!O20)/(duomenys!$E20-duomenys!$D20)),\"\")","v":""}]
[{"$f":"IF(duomenys!$F22<>\"\",duomenys!$A22*(1-(duomenys!$E22-duomenys!F22)/(duomenys!$E22-duomenys!$D22)),\"\")","v":""},{"$f":"IF(duomenys!$F22<>\"\",duomenys!$A22*(1-(duomenys!$E22-duomenys!G22)/(duomenys!$E22-duomenys!$D22)),\"\")","v":""},{"$f":"IF(duomenys!$F22<>\"\",duomenys!$A22*(1-(duomenys!$E22-duomenys!H22)/(duomenys!$E22-duomenys!$D22)),\"\")","v":""},{"$f":"IF(duomenys!$F22<>\"\",duomenys!$A22*(1-(duomenys!$E22-duomenys!I22)/(duomenys!$E22-duomenys!$D22)),\"\")","v":""},{"$f":"IF(duomenys!$F22<>\"\",duomenys!$A22*(1-(duomenys!$E22-duomenys!J22)/(duomenys!$E22-duomenys!$D22)),\"\")","v":""},{"$f":"IF(duomenys!$F22<>\"\",duomenys!$A22*(1-(duomenys!$E22-duomenys!K22)/(duomenys!$E22-duomenys!$D22)),\"\")","v":""},{"$f":"IF(duomenys!$F22<>\"\",duomenys!$A22*(1-(duomenys!$E22-duomenys!L22)/(duomenys!$E22-duomenys!$D22)),\"\")","v":""},{"$f":"IF(duomenys!$F22<>\"\",duomenys!$A22*(1-(duomenys!$E22-duomenys!M22)/(duomenys!$E22-duomenys!$D22)),\"\")","v":""},{"$f":"IF(duomenys!$F22<>\"\",duomenys!$A22*(1-(duomenys!$E22-duomenys!N22)/(duomenys!$E22-duomenys!$D22)),\"\")","v":""},{"$f":"IF(duomenys!$F22<>\"\",duomenys!$A22*(1-(duomenys!$E22-duomenys!O22)/(duomenys!$E22-duomenys!$D22)),\"\")","v":""}]
[{"$f":"IF(duomenys!$F24<>\"\",duomenys!$A24*(1-(duomenys!$E24-duomenys!F24)/(duomenys!$E24-duomenys!$D24)),\"\")","v":""},{"$f":"IF(duomenys!$F24<>\"\",duomenys!$A24*(1-(duomenys!$E24-duomenys!G24)/(duomenys!$E24-duomenys!$D24)),\"\")","v":""},{"$f":"IF(duomenys!$F24<>\"\",duomenys!$A24*(1-(duomenys!$E24-duomenys!H24)/(duomenys!$E24-duomenys!$D24)),\"\")","v":""},{"$f":"IF(duomenys!$F24<>\"\",duomenys!$A24*(1-(duomenys!$E24-duomenys!I24)/(duomenys!$E24-duomenys!$D24)),\"\")","v":""},{"$f":"IF(duomenys!$F24<>\"\",duomenys!$A24*(1-(duomenys!$E24-duomenys!J24)/(duomenys!$E24-duomenys!$D24)),\"\")","v":""},{"$f":"IF(duomenys!$F24<>\"\",duomenys!$A24*(1-(duomenys!$E24-duomenys!K24)/(duomenys!$E24-duomenys!$D24)),\"\")","v":""},{"$f":"IF(duomenys!$F24<>\"\",duomenys!$A24*(1-(duomenys!$E24-duomenys!L24)/(duomenys!$E24-duomenys!$D24)),\"\")","v":""},{"$f":"IF(duomenys!$F24<>\"\",duomenys!$A24*(1-(duomenys!$E24-duomenys!M24)/(duomenys!$E24-duomenys!$D24)),\"\")","v":""},{"$f":"IF(duomenys!$F24<>\"\",duomenys!$A24*(1-(duomenys!$E24-duomenys!N24)/(duomenys!$E24-duomenys!$D24)),\"\")","v":""},{"$f":"IF(duomenys!$F24<>\"\",duomenys!$A24*(1-(duomenys!$E24-duomenys!O24)/(duomenys!$E24-duomenys!$D24)),\"\")","v":""}]
[{"$f":"IF(duomenys!$F26<>\"\",duomenys!$A26*(1-(duomenys!$E26-duomenys!F26)/(duomenys!$E26-duomenys!$D26)),\"\")","v":""},{"$f":"IF(duomenys!$F26<>\"\",duomenys!$A26*(1-(duomenys!$E26-duomenys!G26)/(duomenys!$E26-duomenys!$D26)),\"\")","v":""},{"$f":"IF(duomenys!$F26<>\"\",duomenys!$A26*(1-(duomenys!$E26-duomenys!H26)/(duomenys!$E26-duomenys!$D26)),\"\")","v":""},{"$f":"IF(duomenys!$F26<>\"\",duomenys!$A26*(1-(duomenys!$E26-duomenys!I26)/(duomenys!$E26-duomenys!$D26)),\"\")","v":""},{"$f":"IF(duomenys!$F26<>\"\",duomenys!$A26*(1-(duomenys!$E26-duomenys!J26)/(duomenys!$E26-duomenys!$D26)),\"\")","v":""},{"$f":"IF(duomenys!$F26<>\"\",duomenys!$A26*(1-(duomenys!$E26-duomenys!K26)/(duomenys!$E26-duomenys!$D26)),\"\")","v":""},{"$f":"IF(duomenys!$F26<>\"\",duomenys!$A26*(1-(duomenys!$E26-duomenys!L26)/(duomenys!$E26-duomenys!$D26)),\"\")","v":""},{"$f":"IF(duomenys!$F26<>\"\",duomenys!$A26*(1-(duomenys!$E26-duomenys!M26)/(duomenys!$E26-duomenys!$D26)),\"\")","v":""},{"$f":"IF(duomenys!$F26<>\"\",duomenys!$A26*(1-(duomenys!$E26-duomenys!N26)/(duomenys!$E26-duomenys!$D26)),\"\")","v":""},{"$f":"IF(duomenys!$F26<>\"\",duomenys!$A26*(1-(duomenys!$E26-duomenys!O26)/(duomenys!$E26-duomenys!$D26)),\"\")","v":""}]
[{"$f":"IF(duomenys!$F28<>\"\",duomenys!$A28*(1-(duomenys!$E28-duomenys!F28)/(duomenys!$E28-duomenys!$D28)),\"\")","v":""},{"$f":"IF(duomenys!$F28<>\"\",duomenys!$A28*(1-(duomenys!$E28-duomenys!G28)/(duomenys!$E28-duomenys!$D28)),\"\")","v":""},{"$f":"IF(duomenys!$F28<>\"\",duomenys!$A28*(1-(duomenys!$E28-duomenys!H28)/(duomenys!$E28-duomenys!$D28)),\"\")","v":""},{"$f":"IF(duomenys!$F28<>\"\",duomenys!$A28*(1-(duomenys!$E28-duomenys!I28)/(duomenys!$E28-duomenys!$D28)),\"\")","v":""},{"$f":"IF(duomenys!$F28<>\"\",duomenys!$A28*(1-(duomenys!$E28-duomenys!J28)/(duomenys!$E28-duomenys!$D28)),\"\")","v":""},{"$f":"IF(duomenys!$F28<>\"\",duomenys!$A28*(1-(duomenys!$E28-duomenys!K28)/(duomenys!$E28-duomenys!$D28)),\"\")","v":""},{"$f":"IF(duomenys!$F28<>\"\",duomenys!$A28*(1-(duomenys!$E28-duomenys!L28)/(duomenys!$E28-duomenys!$D28)),\"\")","v":""},{"$f":"IF(duomenys!$F28<>\"\",duomenys!$A28*(1-(duomenys!$E28-duomenys!M28)/(duomenys!$E28-duomenys!$D28)),\"\")","v":""},{"$f":"IF(duomenys!$F28<>\"\",duomenys!$A28*(1-(duomenys!$E28-duomenys!N28)/(duomenys!$E28-duomenys!$D28)),\"\")","v":""},{"$f":"IF(duomenys!$F28<>\"\",duomenys!$A28*(1-(duomenys!$E28-duomenys!O28)/(duomenys!$E28-duomenys!$D28)),\"\")","v":""}]
[{"$f":"IF(duomenys!$F30<>\"\",duomenys!$A30*(1-(duomenys!$E30-duomenys!F30)/(duomenys!$E30-duomenys!$D30)),\"\")","v":""},{"$f":"IF(duomenys!$F30<>\"\",duomenys!$A30*(1-(duomenys!$E30-duomenys!G30)/(duomenys!$E30-duomenys!$D30)),\"\")","v":""},{"$f":"IF(duomenys!$F30<>\"\",duomenys!$A30*(1-(duomenys!$E30-duomenys!H30)/(duomenys!$E30-duomenys!$D30)),\"\")","v":""},{"$f":"IF(duomenys!$F30<>\"\",duomenys!$A30*(1-(duomenys!$E30-duomenys!I30)/(duomenys!$E30-duomenys!$D30)),\"\")","v":""},{"$f":"IF(duomenys!$F30<>\"\",duomenys!$A30*(1-(duomenys!$E30-duomenys!J30)/(duomenys!$E30-duomenys!$D30)),\"\")","v":""},{"$f":"IF(duomenys!$F30<>\"\",duomenys!$A30*(1-(duomenys!$E30-duomenys!K30)/(duomenys!$E30-duomenys!$D30)),\"\")","v":""},{"$f":"IF(duomenys!$F30<>\"\",duomenys!$A30*(1-(duomenys!$E30-duomenys!L30)/(duomenys!$E30-duomenys!$D30)),\"\")","v":""},{"$f":"IF(duomenys!$F30<>\"\",duomenys!$A30*(1-(duomenys!$E30-duomenys!M30)/(duomenys!$E30-duomenys!$D30)),\"\")","v":""},{"$f":"IF(duomenys!$F30<>\"\",duomenys!$A30*(1-(duomenys!$E30-duomenys!N30)/(duomenys!$E30-duomenys!$D30)),\"\")","v":""},{"$f":"IF(duomenys!$F30<>\"\",duomenys!$A30*(1-(duomenys!$E30-duomenys!O30)/(duomenys!$E30-duomenys!$D30)),\"\")","v":""}]